program: Orca
programVersion: 4.2.1
elementType: Cl O O N N N C C C C C C C C C C C C C C C C C C C H H H H H H H H H H H H H H H H H H H H H H H H
charge: 0
multiplicity: 1
keywords: wb97x-d3
keywords: def2-TZVPP
keywords: def2/J RIJCOSX GRIDX6 NOFINALGRIDX
keywords: grid4 nofinalgrid
keywords: scfconv7
keywords: smallprint printgap noloewdin
keywords: NOSOSCF
formula: C19H24ClN3O2
InChI: InChI=1/C19H24ClN3O2/c1-18(2)13-25-19(3,23(18)17(24)22-12-11-21-14-22)10-4-5-15-6-8-16(20)9-7-15/h6-9,11-12,14H,4-5,10,13H2,1-3H3
49 atoms
Cl -5.021722 0.988206 -2.337949
O  2.436358 1.546166 0.518627
O  1.857082 -2.185345 -1.773539
N  2.317156 -0.569137 -0.248212
N  0.868356 -2.36022 0.260822
N  -1.01542 -3.178795 1.058341
C  1.975355 0.286746 0.931858
C  3.21763 0.166249 -1.166014
C  3.579719 1.346303 -0.264097
C  0.473295 0.40292 1.186187
C  2.737206 -0.150241 2.184059
C  4.457129 -0.631881 -1.54336
C  2.478546 0.67822 -2.403892
C  0.06667 1.613676 2.020848
C  1.725725 -1.702652 -0.676925
C  -1.404781 1.52513 2.444299
C  -2.343454 1.390797 1.277582
C  1.185316 -2.983563 1.441956
C  -0.467517 -2.533779 0.072367
C  -2.863636 0.154124 0.908029
C  -2.674433 2.499008 0.503294
C  0.005814 -3.476595 1.913985
C  -3.685943 0.021115 -0.200801
C  -3.495437 2.385688 -0.606506
C  -3.996801 1.141075 -0.953518
H  4.465073 1.12559 0.347928
H  3.781536 2.255692 -0.830446
H  0.125548 -0.495036 1.698993
H  -0.047053 0.446131 0.226481
H  3.786484 -0.357463 1.972386
H  2.301922 -1.04142 2.628911
H  2.697333 0.641835 2.931843
H  4.225951 -1.451153 -2.21937
H  4.94574 -1.040322 -0.657559
H  5.172297 0.022061 -2.045925
H  1.621618 1.291863 -2.122278
H  3.151989 1.29939 -2.997259
H  2.13194 -0.132932 -3.037829
H  0.676042 1.688169 2.92507
H  0.234446 2.532644 1.457031
H  -1.659375 2.415385 3.024778
H  -1.534675 0.672858 3.116462
H  2.19618 -3.064517 1.8005
H  -0.978526 -2.13842 -0.792096
H  -2.618361 -0.731985 1.481885
H  -2.286189 3.475016 0.77069
H  -0.157311 -4.04509 2.815511
H  -4.082733 -0.947726 -0.471732
H  -3.746252 3.257077 -1.195429
totalener: -1513.49216655 hartree
nucrepener: 2475.28038182 hartree
electener: -3988.77254837 hartree
oneelecener: -6987.53224420 hartree
twoeener: 2998.75969584 hartree
kineticenergy: 1508.19773063 hartree
xcener: -124.310328597994 hartree
chargesum: -0.0000000
charge: -0.085354 -0.317630 -0.361912 -0.061931 -0.011236 -0.310843 0.218937 0.110248 0.071344 -0.151796 -0.331358 -0.308519 -0.342751 -0.148404 0.306822 -0.121529 0.074804 -0.158452 0.041685 -0.196339 -0.178134 -0.079108 -0.154461 -0.129634 0.099183 0.064942 0.091093 0.069117 0.096276 0.096560 0.106228 0.108267 0.122607 0.084634 0.098891 0.106296 0.088857 0.121051 0.078567 0.086195 0.094720 0.086561 0.160086 0.139091 0.132254 0.112651 0.128077 0.134050 0.119297
qa: -0.0854 -0.3176 -0.3619 -0.0619 -0.0112 -0.3108 0.2189 0.1102 0.0713 -0.1518 -0.3314 -0.3085 -0.3428 -0.1484 0.3068 -0.1215 0.0748 -0.1585 0.0417 -0.1963 -0.1781 -0.0791 -0.1545 -0.1296 0.0992 0.0649 0.0911 0.0691 0.0963 0.0966 0.1062 0.1083 0.1226 0.0846 0.0989 0.1063 0.0889 0.1211 0.0786 0.0862 0.0947 0.0866 0.1601 0.1391 0.1323 0.1127 0.1281 0.1341 0.1193
va: 1.2216 2.0153 2.1389 3.0827 3.2554 3.0781 4.0814 3.9937 3.9267 3.8252 3.9485 3.9050 3.9153 3.9075 4.2809 3.8376 3.5634 3.8895 4.0113 3.9253 4.0162 4.0249 4.0076 4.0155 3.8974 1.0009 0.9950 1.0057 1.0135 1.0079 1.0117 1.0113 1.0160 1.0076 1.0022 1.0071 1.0045 1.0203 1.0199 1.0236 1.0085 1.0124 0.9956 1.0084 1.0256 1.0096 1.0094 1.0077 1.0127
dispcorr: -0.030541155 hartree
energy: -1513.522707704641
dipole: 32.21408 -30.27593 1.93815 5.68197 -4.50029 1.18168 12.82345 -11.80364 1.01981
magnitude: 2.48853 au
magnitude: 6.32535 debye
