program: Orca
programVersion: 4.2.1
elementType: Cl O O N N N C C C C C C C C C C C C C C C C C C C H H H H H H H H H H H H H H H H H H H H H H H H
charge: 0
multiplicity: 1
keywords: wb97x-d3
keywords: def2-TZVPP
keywords: def2/J RIJCOSX GRIDX6 NOFINALGRIDX
keywords: grid4 nofinalgrid
keywords: scfconv7
keywords: smallprint printgap noloewdin
keywords: NOSOSCF
formula: C19H24ClN3O2
InChI: InChI=1/C19H24ClN3O2/c1-18(2)13-25-19(3,23(18)17(24)22-12-11-21-14-22)10-4-5-15-6-8-16(20)9-7-15/h6-9,11-12,14H,4-5,10,13H2,1-3H3
49 atoms
Cl -4.807127 0.913486 -2.666408
O  2.58794 1.594335 0.286499
O  1.672855 -2.35108 -1.434463
N  2.345446 -0.607259 -0.141151
N  0.892488 -2.258815 0.693782
N  0.383265 -3.251217 2.595536
C  2.043455 0.444957 0.882325
C  3.244063 -0.059084 -1.182938
C  3.708774 1.199806 -0.455083
C  0.544705 0.679769 1.066521
C  2.753094 0.183943 2.212467
C  4.413616 -0.982695 -1.489541
C  2.491841 0.334535 -2.455928
C  0.192146 2.019261 1.705549
C  1.66304 -1.74508 -0.392771
C  -1.293321 2.084647 2.079793
C  -2.204424 1.80318 0.9177
C  -0.442795 -2.569962 0.62488
C  1.338218 -2.717428 1.89764
C  -2.388378 2.748637 -0.087278
C  -2.847614 0.576896 0.786724
C  -0.736036 -3.156793 1.817433
C  -3.184325 2.485046 -1.18975
C  -3.648681 0.294246 -0.309386
C  -3.811257 1.25319 -1.294887
H  4.57584 0.993273 0.187898
H  3.97984 2.003414 -1.140041
H  0.128084 -0.119797 1.681096
H  0.055325 0.613323 0.091501
H  3.775364 -0.165826 2.067993
H  2.228717 -0.550262 2.818591
H  2.796583 1.108998 2.786463
H  4.920079 -1.2938 -0.574901
H  5.140779 -0.457582 -2.111566
H  4.099084 -1.872013 -2.029933
H  1.673335 1.02005 -2.233864
H  3.175911 0.843484 -3.137178
H  2.088654 -0.530064 -2.974818
H  0.77679 2.186801 2.613637
H  0.438855 2.834816 1.023768
H  -1.511426 3.07342 2.491065
H  -1.493149 1.368016 2.880517
H  -1.042123 -2.33045 -0.236505
H  2.377402 -2.666039 2.181123
H  -1.90215 3.71421 -0.010434
H  -2.71953 -0.179226 1.552229
H  -1.691745 -3.523518 2.156162
H  -3.319734 3.231346 -1.96037
H  -4.145446 -0.662671 -0.393611
totalener: -1513.49172920 hartree
nucrepener: 2466.94973828 hartree
electener: -3980.44146748 hartree
oneelecener: -6970.65286595 hartree
twoeener: 2990.21139847 hartree
kineticenergy: 1508.20055160 hartree
xcener: -124.309293838450 hartree
chargesum: -0.0000000
charge: -0.082337 -0.320576 -0.361281 -0.076360 -0.020295 -0.293160 0.236861 0.110261 0.067622 -0.172461 -0.353510 -0.305512 -0.341234 -0.140968 0.315767 -0.131851 0.059704 -0.128517 0.000897 -0.173149 -0.168695 -0.083874 -0.128078 -0.139285 0.091450 0.065800 0.091694 0.079701 0.100607 0.099371 0.120448 0.112089 0.085712 0.097874 0.122188 0.104227 0.088646 0.121057 0.080596 0.087046 0.098686 0.087121 0.145653 0.150557 0.113493 0.112550 0.129565 0.120409 0.123490
qa: -0.0823 -0.3206 -0.3613 -0.0764 -0.0203 -0.2932 0.2369 0.1103 0.0676 -0.1725 -0.3535 -0.3055 -0.3412 -0.1410 0.3158 -0.1319 0.0597 -0.1285 0.0009 -0.1731 -0.1687 -0.0839 -0.1281 -0.1393 0.0915 0.0658 0.0917 0.0797 0.1006 0.0994 0.1204 0.1121 0.0857 0.0979 0.1222 0.1042 0.0886 0.1211 0.0806 0.0870 0.0987 0.0871 0.1457 0.1506 0.1135 0.1125 0.1296 0.1204 0.1235
va: 1.2246 2.0073 2.1402 3.0761 3.2550 3.1242 4.0681 4.0085 3.9374 3.8457 3.9487 3.9029 3.9145 3.8889 4.2739 3.8393 3.5984 3.8957 4.0509 4.0036 3.9431 4.0164 4.0127 4.0068 3.9233 1.0012 0.9956 0.9996 1.0106 1.0071 0.9994 1.0118 1.0090 1.0027 1.0145 1.0078 1.0049 1.0212 1.0199 1.0230 1.0073 1.0109 1.0129 0.9950 1.0102 1.0163 1.0089 1.0119 1.0108
dispcorr: -0.030121849 hartree
energy: -1513.521851045377
dipole: 29.71793 -28.52110 1.19682 6.72447 -5.22347 1.50100 10.79231 -10.54561 0.24670
magnitude: 1.93552 au
magnitude: 4.91970 debye
