program: Orca
programVersion: 4.2.1
elementType: Cl O O N N N C C C C C C C C C C C C C C C C C C C H H H H H H H H H H H H H H H H H H H H H H H H
charge: 0
multiplicity: 1
keywords: wb97x-d3
keywords: def2-TZVPP
keywords: def2/J RIJCOSX GRIDX6 NOFINALGRIDX
keywords: grid4 nofinalgrid
keywords: scfconv7
keywords: smallprint printgap noloewdin
keywords: NOSOSCF
formula: C19H24ClN3O2
InChI: InChI=1/C19H24ClN3O2/c1-18(2)13-25-19(3,23(18)17(24)22-12-11-21-14-22)10-4-5-15-6-8-16(20)9-7-15/h6-9,11-12,14H,4-5,10,13H2,1-3H3
49 atoms
Cl -5.631425 3.956551 1.270892
O  1.112439 1.179681 0.479734
O  1.359276 -2.807353 1.501729
N  1.824081 -0.943923 0.281354
N  2.691715 -3.040029 -0.318743
N  3.256711 -4.15317 -2.137439
C  0.851544 -0.091601 1.021548
C  2.831166 -0.103448 -0.415097
C  2.486282 1.246819 0.228893
C  -0.598399 -0.476957 0.738326
C  1.107584 -0.063189 2.530836
C  4.274121 -0.480882 -0.102258
C  2.615844 -0.008847 -1.925063
C  -1.032737 -0.561519 -0.722174
C  1.907423 -2.25979 0.577827
C  -1.306485 0.76511 -1.443244
C  -2.379468 1.582662 -0.780997
C  3.649171 -3.949544 0.060694
C  2.482225 -3.232853 -1.653777
C  -3.724175 1.310121 -1.015625
C  -2.065923 2.607606 0.106737
C  4.001013 -4.599041 -1.081191
C  -4.728883 2.03129 -0.391486
C  -3.057584 3.340206 0.741151
C  -4.386762 3.046327 0.487474
H  3.064991 1.400645 1.149786
H  2.685136 2.087233 -0.436525
H  -1.236906 0.22765 1.278818
H  -0.773005 -1.444698 1.209893
H  0.521505 0.746829 2.965649
H  2.156892 0.117124 2.76722
H  0.81718 -0.992199 3.010445
H  4.42423 -0.643467 0.966004
H  4.930094 0.337019 -0.405991
H  4.605531 -1.369549 -0.635662
H  1.578113 0.215766 -2.170466
H  3.234063 0.793749 -2.330259
H  2.907082 -0.918302 -2.44432
H  -0.300568 -1.135083 -1.298138
H  -1.951066 -1.153968 -0.752131
H  -1.612711 0.533654 -2.466948
H  -0.393752 1.353849 -1.521872
H  3.98611 -4.034689 1.078978
H  1.715337 -2.702838 -2.195823
H  -3.99739 0.521193 -1.706955
H  -1.027456 2.834684 0.312398
H  4.746464 -5.368551 -1.200725
H  -5.768555 1.809988 -0.589648
H  -2.797544 4.135331 1.426349
totalener: -1513.49141096 hartree
nucrepener: 2414.37163428 hartree
electener: -3927.86304524 hartree
oneelecener: -6865.37582211 hartree
twoeener: 2937.51277688 hartree
kineticenergy: 1508.19476063 hartree
xcener: -124.310339756992 hartree
chargesum: 0.0000000
charge: -0.086805 -0.338487 -0.359251 -0.060610 -0.022383 -0.295316 0.229882 0.091125 0.075972 -0.181101 -0.309097 -0.328939 -0.361488 -0.179168 0.304356 -0.089332 0.061450 -0.126759 0.007255 -0.191585 -0.222147 -0.074077 -0.126681 -0.107395 0.077627 0.073175 0.088321 0.111683 0.126692 0.105596 0.080576 0.119288 0.101679 0.107585 0.114942 0.116001 0.098988 0.123137 0.066567 0.099863 0.096020 0.078860 0.147862 0.146074 0.113970 0.127268 0.129756 0.119621 0.119436
qa: -0.0868 -0.3385 -0.3593 -0.0606 -0.0224 -0.2953 0.2299 0.0911 0.0760 -0.1811 -0.3091 -0.3289 -0.3615 -0.1792 0.3044 -0.0893 0.0614 -0.1268 0.0073 -0.1916 -0.2221 -0.0741 -0.1267 -0.1074 0.0776 0.0732 0.0883 0.1117 0.1267 0.1056 0.0806 0.1193 0.1017 0.1076 0.1149 0.1160 0.0990 0.1231 0.0666 0.0999 0.0960 0.0789 0.1479 0.1461 0.1140 0.1273 0.1298 0.1196 0.1194
va: 1.2199 1.9781 2.1463 3.0503 3.2465 3.1318 4.1104 3.9481 3.8997 3.7467 3.9372 3.9526 3.9274 3.9402 4.2795 3.8029 3.6282 3.9169 4.0621 4.0319 3.9516 4.0214 4.0139 4.0077 3.9264 1.0032 0.9971 1.0056 1.0212 1.0099 1.0075 1.0221 1.0030 1.0056 0.9966 0.9963 1.0113 1.0032 1.0217 1.0106 1.0045 1.0272 1.0110 0.9940 1.0096 1.0284 1.0085 1.0119 1.0125
dispcorr: -0.030451603 hartree
energy: -1513.521862560129
dipole: 27.49363 -26.30279 1.19084 -7.79477 8.68735 0.89258 -5.77132 5.81445 0.04313
magnitude: 1.48884 au
magnitude: 3.78434 debye
