program: Orca
programVersion: 4.2.1
elementType: Cl O O N N N C C C C C C C C C C C C C C C C C C C H H H H H H H H H H H H H H H H H H H H H H H H
charge: 0
multiplicity: 1
keywords: wb97x-d3
keywords: def2-TZVPP
keywords: def2/J RIJCOSX GRIDX6 NOFINALGRIDX
keywords: grid4 nofinalgrid
keywords: scfconv7
keywords: smallprint printgap noloewdin
keywords: NOSOSCF
formula: C19H24ClN3O2
InChI: InChI=1/C19H24ClN3O2/c1-18(2)13-25-19(3,23(18)17(24)22-12-11-21-14-22)10-4-5-15-6-8-16(20)9-7-15/h6-9,11-12,14H,4-5,10,13H2,1-3H3
49 atoms
Cl -5.407591 -0.70507 0.963976
O  2.847969 1.598958 0.59757
O  2.674072 -2.136689 -1.698396
N  2.520266 -0.516545 -0.113834
N  0.635348 -1.76789 -0.795299
N  -1.400703 -2.222346 -1.511137
C  1.807324 0.663431 0.475915
C  3.9834 -0.285176 -0.087328
C  4.019027 0.887763 0.889434
C  0.756381 1.248562 -0.461776
C  1.229648 0.367645 1.865575
C  4.749977 -1.48237 0.454538
C  4.535563 0.169058 -1.440592
C  0.262964 2.63494 -0.055899
C  2.026668 -1.489937 -0.911636
C  -1.023125 3.019608 -0.800088
C  -2.177903 2.138467 -0.411543
C  -0.106911 -2.095967 0.315275
C  -0.198567 -1.889664 -1.867721
C  -2.577299 1.069486 -1.205154
C  -2.8244 2.323598 0.808528
C  -1.35552 -2.366176 -0.152495
C  -3.572181 0.194005 -0.796969
C  -3.825004 1.465679 1.232054
C  -4.186706 0.396862 0.425432
H  4.041551 0.542032 1.932638
H  4.878315 1.539258 0.729696
H  -0.096169 0.571187 -0.491556
H  1.167252 1.295474 -1.475285
H  1.855447 -0.326976 2.426325
H  0.225599 -0.046423 1.807674
H  1.1661 1.293709 2.436159
H  4.755831 -2.313949 -0.24661
H  4.325227 -1.828309 1.398183
H  5.788027 -1.199174 0.63985
H  5.587429 0.438606 -1.328885
H  4.469932 -0.61258 -2.191378
H  4.004625 1.049068 -1.80505
H  0.060969 2.673996 1.017644
H  1.036002 3.379801 -0.251038
H  -0.855833 2.964961 -1.879303
H  -1.260362 4.063205 -0.579725
H  0.321424 -2.161268 1.298524
H  0.140212 -1.705916 -2.875313
H  -2.092628 0.893968 -2.157888
H  -2.539924 3.152684 1.446451
H  -2.223887 -2.659476 0.415845
H  -3.836965 -0.650852 -1.416962
H  -4.316526 1.621507 2.182484
totalener: -1513.49186625 hartree
nucrepener: 2499.28338212 hartree
electener: -4012.77524837 hartree
oneelecener: -7035.70873071 hartree
twoeener: 3022.93348234 hartree
kineticenergy: 1508.19330309 hartree
xcener: -124.310594356398 hartree
chargesum: 0.0000000
charge: -0.089655 -0.318090 -0.371126 -0.083331 -0.024583 -0.317641 0.232908 0.115842 0.065975 -0.118350 -0.363365 -0.305476 -0.344238 -0.162727 0.331920 -0.117537 0.086449 -0.158553 0.037652 -0.154384 -0.220550 -0.053933 -0.140729 -0.118738 0.088274 0.065901 0.093456 0.034488 0.097540 0.099572 0.117596 0.113770 0.121909 0.085463 0.097865 0.089100 0.121649 0.101942 0.079740 0.088650 0.082339 0.097221 0.165416 0.136578 0.121689 0.113056 0.127924 0.132491 0.118636
qa: -0.0897 -0.3181 -0.3711 -0.0833 -0.0246 -0.3176 0.2329 0.1158 0.0660 -0.1183 -0.3634 -0.3055 -0.3442 -0.1627 0.3319 -0.1175 0.0864 -0.1586 0.0377 -0.1544 -0.2206 -0.0539 -0.1407 -0.1187 0.0883 0.0659 0.0935 0.0345 0.0975 0.0996 0.1176 0.1138 0.1219 0.0855 0.0979 0.0891 0.1216 0.1019 0.0797 0.0886 0.0823 0.0972 0.1654 0.1366 0.1217 0.1131 0.1279 0.1325 0.1186
va: 1.2165 2.0142 2.1301 3.0650 3.2620 3.0741 4.0651 4.0107 3.9381 3.8292 3.9271 3.9034 3.9149 3.9266 4.2639 3.8597 3.5691 3.8909 4.0321 3.9116 4.0194 3.9952 3.9479 4.0132 3.8879 1.0006 0.9946 1.0395 1.0113 1.0072 1.0033 1.0135 1.0139 1.0090 1.0026 1.0051 1.0213 1.0084 1.0079 1.0278 1.0126 1.0068 0.9928 1.0113 1.0111 1.0091 1.0130 1.0239 1.0126
dispcorr: -0.032036265 hartree
energy: -1513.523902516630
dipole: 34.28122 -32.70554 1.57568 12.20303 -10.92168 1.28135 1.81536 -0.75050 1.06486
magnitude: 2.29316 au
magnitude: 5.82874 debye
