program: Orca
programVersion: 4.2.1
elementType: Cl F O N N C C C C C C C C C C C C C C C C C H H H H H H H H H H H H
charge: 0
multiplicity: 1
keywords: wb97x-d3
keywords: def2-TZVPP
keywords: def2/J RIJCOSX GRIDX6 NOFINALGRIDX
keywords: grid4 nofinalgrid
keywords: scfconv7
keywords: smallprint printgap noloewdin
keywords: NOSOSCF
formula: C17H12ClFN2O
InChI: InChI=1/C17H12ClFN2O/c18-16-4-2-1-3-15(16)17(22,13-9-20-11-21-10-13)12-5-7-14(19)8-6-12/h1-11,22H
34 atoms
Cl -2.659795 1.274902 1.541223
F  4.986293 -1.521324 -1.616637
O  0.337745 0.42723 1.984883
N  -2.583699 -2.201448 -0.682581
N  -1.711875 -3.086118 1.327619
C  0.08955 0.146983 0.626648
C  1.421131 -0.30547 0.03041
C  -0.446218 1.407978 -0.068462
C  -0.885917 -1.015993 0.491737
C  2.618027 -0.113704 0.711142
C  1.460514 -0.911137 -1.224381
C  -1.668753 1.980872 0.294067
C  0.281612 2.071752 -1.052324
C  -1.769951 -1.15933 -0.565949
C  -0.900266 -2.041254 1.426164
C  3.825976 -0.525071 0.161878
C  2.656093 -1.316169 -1.792548
C  -2.157207 3.129509 -0.305089
C  -0.187385 3.227482 -1.659942
C  3.823759 -1.119352 -1.081332
C  -1.412203 3.755713 -1.29163
C  -2.514948 -3.111168 0.275319
H  2.636541 0.358778 1.681694
H  0.553309 -1.073173 -1.791637
H  1.241696 1.684158 -1.360298
H  -0.4952 0.619057 2.432615
H  -1.835963 -0.412068 -1.349328
H  -0.242014 -2.024234 2.286239
H  4.752354 -0.381486 0.701832
H  2.674279 -1.781713 -2.768757
H  -3.11106 3.536339 0.001113
H  0.411005 3.710024 -2.420312
H  -1.792211 4.652891 -1.760512
H  -3.179345 -3.96164 0.189309
elementType: Cl F O N C H
totalener: -1399.88364054 hartree
nucrepener: 1897.51046755 hartree
electener: -3297.39410810 hartree
oneelecener: -5685.94247974 hartree
twoeener: 2388.54837165 hartree
cpcmener: -0.02457980 hartree
kineticenergy: 1395.37912335 hartree
xcener: -110.803983408611 hartree
chargesum: 0.0000000
charge: -0.091178 -0.223853 -0.401788 -0.353097 -0.358509 0.860375 -0.116561 -0.139554 -0.188003 -0.203301 -0.227741 -0.056336 -0.090907 0.046273 -0.000765 -0.195271 -0.182933 -0.145138 -0.175445 0.297942 -0.138208 0.182530 0.145073 0.160292 0.159500 0.227501 0.151408 0.133514 0.154123 0.154848 0.143200 0.163073 0.166495 0.142437
qa: -0.0912 -0.2239 -0.4018 -0.3531 -0.3585 0.8604 -0.1166 -0.1396 -0.1880 -0.2033 -0.2277 -0.0563 -0.0909 0.0463 -0.0008 -0.1953 -0.1829 -0.1451 -0.1754 0.2979 -0.1382 0.1825 0.1451 0.1603 0.1595 0.2275 0.1514 0.1335 0.1541 0.1548 0.1432 0.1631 0.1665 0.1424
va: 1.2440 1.0545 2.0000 3.0428 3.0332 3.1266 3.6460 3.5702 3.7141 3.9793 3.9276 3.9401 3.8127 4.0229 4.1270 3.8994 3.9256 4.0023 3.9604 3.9092 3.9086 4.0063 1.0345 0.9983 0.9967 1.0339 1.0032 1.0354 0.9989 0.9984 1.0059 0.9909 0.9859 0.9947
dispcorr: -0.019204958 hartree
energy: -1399.902845500283
dipole: 0.49812 -0.53916 -0.04104 4.20337 -2.37282 1.83055 -4.44403 3.78724 -0.65680
magnitude: 1.94524 au
magnitude: 4.94442 debye
