program: Orca
programVersion: 4.2.1
elementType: Cl F O N N C C C C C C C C C C C C C C C C C H H H H H H H H H H H H
charge: 0
multiplicity: 1
keywords: wb97x-d3
keywords: def2-TZVPP
keywords: def2/J RIJCOSX GRIDX6 NOFINALGRIDX
keywords: grid4 nofinalgrid
keywords: scfconv7
keywords: smallprint printgap noloewdin
keywords: NOSOSCF
formula: C17H12ClFN2O
InChI: InChI=1/C17H12ClFN2O/c18-16-4-2-1-3-15(16)17(22,13-9-20-11-21-10-13)12-5-7-14(19)8-6-12/h1-11,22H
34 atoms
Cl 1.028598 2.585485 1.209288
F  4.752884 -1.4252 -0.965986
O  -0.55576 0.051602 2.056782
N  -3.0601 -2.823377 0.869645
N  -1.999092 -2.970039 -1.235071
C  -0.471496 -0.075073 0.655233
C  0.957543 -0.389836 0.212263
C  -0.99837 1.204703 -0.01026
C  -1.341388 -1.274258 0.306223
C  1.451526 0.017306 -1.021968
C  1.770711 -1.161117 1.037702
C  -0.382304 2.441883 0.199933
C  -2.127663 1.204932 -0.824207
C  -2.298516 -1.776802 1.174815
C  -1.23872 -1.933896 -0.911203
C  2.73065 -0.330891 -1.430672
C  3.054373 -1.511051 0.649902
C  -0.848545 3.609598 -0.379488
C  -2.612506 2.365482 -1.410775
C  3.51171 -1.088017 -0.5823
C  -1.970725 3.571197 -1.192349
C  -2.872638 -3.364929 -0.320954
H  0.845352 0.616555 -1.689328
H  1.412906 -1.502423 1.999744
H  -2.657167 0.282868 -1.014607
H  0.110917 0.679385 2.35967
H  -2.470985 -1.33379 2.145985
H  -0.521838 -1.619286 -1.660641
H  3.109734 -0.011098 -2.392077
H  3.684591 -2.105578 1.297889
H  -0.340196 4.54587 -0.194524
H  -3.492986 2.31834 -2.036542
H  -2.335029 4.48307 -1.645054
H  -3.492692 -4.215449 -0.574924
elementType: Cl F O N C H
totalener: -1399.88409646 hartree
nucrepener: 1899.18786746 hartree
electener: -3299.07196392 hartree
oneelecener: -5689.26261685 hartree
twoeener: 2390.19065293 hartree
cpcmener: -0.02438526 hartree
kineticenergy: 1395.37934793 hartree
xcener: -110.804171004184 hartree
chargesum: 0.0000000
charge: -0.091600 -0.224196 -0.408916 -0.361772 -0.356141 0.877935 -0.100422 -0.140732 -0.267407 -0.178194 -0.203524 -0.077128 -0.073500 0.033381 0.033127 -0.193784 -0.206739 -0.143128 -0.169839 0.301388 -0.140061 0.188200 0.162835 0.145368 0.164110 0.229111 0.134496 0.146922 0.155059 0.154133 0.141370 0.161902 0.166026 0.141720
qa: -0.0916 -0.2242 -0.4089 -0.3618 -0.3561 0.8779 -0.1004 -0.1407 -0.2674 -0.1782 -0.2035 -0.0771 -0.0735 0.0334 0.0331 -0.1938 -0.2067 -0.1431 -0.1698 0.3014 -0.1401 0.1882 0.1628 0.1454 0.1641 0.2291 0.1345 0.1469 0.1551 0.1541 0.1414 0.1619 0.1660 0.1417
va: 1.2430 1.0536 1.9946 3.0334 3.0474 3.0920 3.5516 3.6418 3.8817 3.8353 3.9745 3.9565 3.7783 4.0978 4.0579 3.9302 3.9180 4.0021 3.9548 3.9019 3.9074 4.0088 0.9917 1.0261 0.9934 1.0359 1.0385 1.0182 0.9960 0.9975 1.0067 0.9918 0.9860 0.9953
dispcorr: -0.019258160 hartree
energy: -1399.903354617195
dipole: -11.48842 11.43187 -0.05655 -0.30489 2.04932 1.74443 -3.96976 3.42671 -0.54304
magnitude: 1.82787 au
magnitude: 4.64609 debye
