program: Orca
programVersion: 4.2.1
elementType: Cl F O N N C C C C C C C C C C C C C C C C C H H H H H H H H H H H H
charge: 0
multiplicity: 1
keywords: wb97x-d3
keywords: def2-TZVPP
keywords: def2/J RIJCOSX GRIDX6 NOFINALGRIDX
keywords: grid4 nofinalgrid
keywords: scfconv7
keywords: smallprint printgap noloewdin
keywords: NOSOSCF
formula: C17H12ClFN2O
InChI: InChI=1/C17H12ClFN2O/c18-16-4-2-1-3-15(16)17(22,13-9-20-11-21-10-13)12-5-7-14(19)8-6-12/h1-11,22H
34 atoms
Cl -0.937262 0.395259 -2.183029
F  5.18669 -1.03205 -0.010944
O  -0.362017 0.050493 2.334763
N  -1.540109 -3.212482 -0.564953
N  -3.37895 -1.910237 0.127847
C  -0.266047 0.048223 0.925242
C  1.210488 -0.20965 0.643182
C  -0.72423 1.401029 0.362908
C  -1.164155 -1.072506 0.40436
C  1.865648 -1.206103 1.369616
C  1.941779 0.510289 -0.293237
C  -1.072228 1.631577 -0.970126
C  -0.790922 2.492962 1.227257
C  -0.714975 -2.253666 -0.165552
C  -2.54395 -0.961623 0.523347
C  3.203585 -1.491259 1.155207
C  3.284125 0.238799 -0.522577
C  -1.503015 2.876013 -1.408673
C  -1.210428 3.742679 0.801224
C  3.891103 -0.761781 0.204732
C  -1.579299 3.934382 -0.519835
C  -2.83322 -2.994932 -0.39887
H  1.333798 -1.782903 2.114734
H  1.490987 1.313955 -0.85713
H  -0.505704 2.366143 2.261961
H  -1.288052 0.10099 2.602742
H  0.340159 -2.434836 -0.330616
H  -3.002766 -0.067894 0.937404
H  3.700968 -2.267911 1.721325
H  3.843593 0.80698 -1.253969
H  -1.77228 3.016146 -2.446836
H  -1.249067 4.562861 1.505548
H  -1.916995 4.901926 -0.866459
H  -3.509843 -3.773971 -0.729634
elementType: Cl F O N C H
totalener: -1399.88688356 hartree
nucrepener: 1910.80038572 hartree
electener: -3310.68726927 hartree
oneelecener: -5712.73005286 hartree
twoeener: 2402.04278359 hartree
cpcmener: -0.02462135 hartree
kineticenergy: 1395.37078150 hartree
xcener: -110.800401925291 hartree
chargesum: 0.0000000
charge: -0.081365 -0.221359 -0.377112 -0.345541 -0.349496 0.879021 -0.100521 -0.109708 -0.270833 -0.286032 -0.156939 -0.034510 -0.124692 0.093737 0.011233 -0.184103 -0.208028 -0.141636 -0.186057 0.294748 -0.133947 0.179232 0.149964 0.161061 0.146675 0.217420 0.137483 0.137624 0.152204 0.150145 0.137972 0.159489 0.162160 0.141713
qa: -0.0814 -0.2214 -0.3771 -0.3455 -0.3495 0.8790 -0.1005 -0.1097 -0.2708 -0.2860 -0.1569 -0.0345 -0.1247 0.0937 0.0112 -0.1841 -0.2080 -0.1416 -0.1861 0.2947 -0.1339 0.1792 0.1500 0.1611 0.1467 0.2174 0.1375 0.1376 0.1522 0.1501 0.1380 0.1595 0.1622 0.1417
va: 1.2383 1.0586 2.0229 3.0489 3.0451 3.1964 3.5537 3.4101 3.7989 4.0237 3.8785 3.9230 3.8981 4.0059 4.1144 3.9097 3.9490 4.0102 3.9514 3.9221 3.9142 4.0094 1.0242 0.9950 1.0338 1.0183 1.0139 1.0099 0.9978 1.0005 1.0110 0.9924 0.9877 0.9943
dispcorr: -0.019652132 hartree
energy: -1399.906535688217
dipole: -5.95859 5.46329 -0.49531 6.68245 -4.92408 1.75837 7.38862 -6.77270 0.61593
magnitude: 1.92784 au
magnitude: 4.90019 debye
