program: Orca
programVersion: 4.2.1
elementType: Cl F O N N C C C C C C C C C C C C C C C C C H H H H H H H H H H H H
charge: 0
multiplicity: 1
keywords: wb97x-d3
keywords: def2-TZVPP
keywords: def2/J RIJCOSX GRIDX6 NOFINALGRIDX
keywords: grid4 nofinalgrid
keywords: scfconv7
keywords: smallprint printgap noloewdin
keywords: NOSOSCF
formula: C17H12ClFN2O
InChI: InChI=1/C17H12ClFN2O/c18-16-4-2-1-3-15(16)17(22,13-9-20-11-21-10-13)12-5-7-14(19)8-6-12/h1-11,22H
34 atoms
Cl -0.420044 0.540886 -2.206082
F  5.223454 -0.870168 -0.100301
O  -0.327631 -0.051537 2.317042
N  -3.352443 -2.086385 0.632869
N  -1.768373 -3.011567 -0.847011
C  -0.246432 0.003281 0.907472
C  1.213746 -0.224043 0.531088
C  -0.814025 1.331404 0.385798
C  -1.190952 -1.099928 0.446288
C  2.016756 0.770457 -0.013866
C  1.810129 -1.434035 0.89016
C  -0.955347 1.634716 -0.970743
C  -1.277472 2.282639 1.29197
C  -2.473393 -1.158544 0.9803
C  -0.895314 -2.076511 -0.491441
C  3.371837 0.561734 -0.231003
C  3.157126 -1.665668 0.672497
C  -1.520666 2.825537 -1.401558
C  -1.842763 3.478601 0.876193
C  3.916385 -0.657543 0.110231
C  -1.966842 3.752854 -0.474887
C  -2.953835 -2.972641 -0.266139
H  1.606172 1.73784 -0.269091
H  1.223781 -2.217878 1.353255
H  -1.210794 2.086027 2.352228
H  0.36924 0.499155 2.694766
H  -2.81025 -0.42971 1.709504
H  0.071275 -2.119687 -0.977769
H  3.989228 1.341992 -0.656725
H  3.608498 -2.610635 0.945432
H  -1.612747 3.024805 -2.460789
H  -2.189827 4.189545 1.614143
H  -2.409022 4.679933 -0.814519
H  -3.667716 -3.736112 -0.552177
elementType: Cl F O N C H
totalener: -1399.88856808 hartree
nucrepener: 1910.33680761 hartree
electener: -3310.22537569 hartree
oneelecener: -5711.77871903 hartree
twoeener: 2401.55334334 hartree
cpcmener: -0.02429293 hartree
kineticenergy: 1395.37336152 hartree
xcener: -110.801542211945 hartree
chargesum: -0.0000000
charge: -0.083721 -0.220813 -0.368777 -0.356173 -0.352204 0.807265 -0.136839 -0.046319 -0.124705 -0.126549 -0.269559 -0.080470 -0.149651 -0.018196 0.048541 -0.206817 -0.201708 -0.130973 -0.166889 0.302795 -0.149917 0.180611 0.159662 0.153255 0.139629 0.216322 0.131073 0.145571 0.151131 0.153245 0.139214 0.159246 0.161935 0.140787
qa: -0.0837 -0.2208 -0.3688 -0.3562 -0.3522 0.8073 -0.1368 -0.0463 -0.1247 -0.1265 -0.2696 -0.0805 -0.1497 -0.0182 0.0485 -0.2068 -0.2017 -0.1310 -0.1669 0.3028 -0.1499 0.1806 0.1597 0.1533 0.1396 0.2163 0.1311 0.1456 0.1511 0.1532 0.1392 0.1592 0.1619 0.1408
va: 1.2421 1.0592 2.0529 3.0395 3.0606 3.2691 3.6403 3.3849 3.5949 3.8262 4.0196 3.9488 3.8976 4.1501 4.0256 3.9350 3.9160 3.9899 3.9486 3.9136 3.9339 4.0101 0.9932 1.0084 1.0361 1.0146 1.0246 1.0116 0.9998 0.9978 1.0090 0.9924 0.9880 0.9943
dispcorr: -0.019551667 hartree
energy: -1399.908119750208
dipole: -7.05336 7.56574 0.51238 6.06396 -4.01978 2.04418 7.78087 -7.07344 0.70743
magnitude: 2.22299 au
magnitude: 5.65038 debye
