program: Orca
programVersion: 4.2.1
elementType: Cl F O N N C C C C C C C C C C C C C C C C C H H H H H H H H H H H H
charge: 0
multiplicity: 1
keywords: wb97x-d3
keywords: def2-TZVPP
keywords: def2/J RIJCOSX GRIDX6 NOFINALGRIDX
keywords: grid4 nofinalgrid
keywords: scfconv7
keywords: smallprint printgap noloewdin
keywords: NOSOSCF
formula: C17H12ClFN2O
InChI: InChI=1/C17H12ClFN2O/c18-16-4-2-1-3-15(16)17(22,13-9-20-11-21-10-13)12-5-7-14(19)8-6-12/h1-11,22H
34 atoms
Cl 0.307951 0.882462 -2.041607
F  5.062307 -0.851097 0.095763
O  -0.686416 -0.187003 2.27614
N  -2.176731 -3.404382 0.421114
N  -2.993274 -1.958244 -1.250992
C  -0.472376 -0.084639 0.8845
C  1.015861 -0.327623 0.612638
C  -0.888965 1.307741 0.38602
C  -1.368881 -1.163641 0.298418
C  1.515015 -1.490489 0.040393
C  1.922273 0.651571 1.016904
C  -0.560538 1.823995 -0.869437
C  -1.65301 2.12071 1.220925
C  -1.409746 -2.427909 0.881774
C  -2.221325 -0.985997 -0.779769
C  2.878802 -1.677006 -0.135521
C  3.287149 0.485443 0.850168
C  -0.945253 3.098832 -1.259023
C  -2.050286 3.393389 0.842135
C  3.743267 -0.682783 0.271661
C  -1.688253 3.889832 -0.398808
C  -2.92632 -3.123252 -0.633594
H  0.85436 -2.270314 -0.311286
H  1.574716 1.581771 1.451687
H  -1.94908 1.752889 2.192951
H  -0.00784 0.311473 2.747493
H  -0.804175 -2.666428 1.748596
H  -2.313628 -0.031438 -1.282031
H  3.254834 -2.583754 -0.590418
H  3.980377 1.256042 1.160181
H  -0.667739 3.46981 -2.236275
H  -2.642181 3.992118 1.521358
H  -1.985478 4.883266 -0.706967
H  -3.549161 -3.921579 -1.019732
elementType: Cl F O N C H
totalener: -1399.88739611 hartree
nucrepener: 1912.50850423 hartree
electener: -3312.39590034 hartree
oneelecener: -5716.09112705 hartree
twoeener: 2403.69522671 hartree
cpcmener: -0.02401164 hartree
kineticenergy: 1395.36858113 hartree
xcener: -110.800398852342 hartree
chargesum: 0.0000000
charge: -0.080849 -0.221249 -0.381974 -0.350715 -0.352672 0.866967 -0.219113 -0.092741 -0.196104 -0.087570 -0.196817 -0.062075 -0.126479 -0.036376 0.052618 -0.190629 -0.223391 -0.137331 -0.182051 0.303000 -0.138419 0.184392 0.159135 0.158143 0.146340 0.222021 0.141854 0.137991 0.151120 0.153033 0.137631 0.159426 0.162159 0.140726
qa: -0.0808 -0.2212 -0.3820 -0.3507 -0.3527 0.8670 -0.2191 -0.0927 -0.1961 -0.0876 -0.1968 -0.0621 -0.1265 -0.0364 0.0526 -0.1906 -0.2234 -0.1373 -0.1821 0.3030 -0.1384 0.1844 0.1591 0.1581 0.1463 0.2220 0.1419 0.1380 0.1511 0.1530 0.1376 0.1594 0.1622 0.1407
va: 1.2399 1.0585 2.0143 3.0334 3.0631 3.2214 3.7463 3.3880 3.6682 3.7735 3.9552 3.9704 3.9047 4.1331 4.0536 3.9254 3.9477 4.0019 3.9494 3.9065 3.9162 4.0093 0.9950 0.9924 1.0340 1.0164 1.0290 1.0191 0.9990 0.9972 1.0106 0.9924 0.9877 0.9943
dispcorr: -0.019680850 hartree
energy: -1399.907076960790
dipole: -9.06306 9.39357 0.33051 4.97206 -3.05758 1.91449 7.13211 -6.35209 0.78002
magnitude: 2.09354 au
magnitude: 5.32136 debye
