program: Orca
programVersion: 4.2.1
elementType: Cl F O N N C C C C C C C C C C C C C C C C C H H H H H H H H H H H H
charge: 0
multiplicity: 1
keywords: wb97x-d3
keywords: def2-TZVPP
keywords: def2/J RIJCOSX GRIDX6 NOFINALGRIDX
keywords: grid4 nofinalgrid
keywords: scfconv7
keywords: smallprint printgap noloewdin
keywords: NOSOSCF
formula: C17H12ClFN2O
InChI: InChI=1/C17H12ClFN2O/c18-16-4-2-1-3-15(16)17(22,13-9-20-11-21-10-13)12-5-7-14(19)8-6-12/h1-11,22H
34 atoms
Cl -2.566245 1.361946 1.692365
F  5.054835 -1.374153 -1.571023
O  0.328078 0.291977 1.998174
N  -2.702481 -2.098943 -0.752461
N  -1.776618 -3.150992 1.149237
C  0.075426 0.082996 0.630362
C  1.4162 -0.344597 0.037959
C  -0.430382 1.379038 -0.026232
C  -0.934219 -1.040605 0.440087
C  2.600578 0.132874 0.5930
C  1.494633 -1.175096 -1.074051
C  -1.597842 2.01658 0.401069
C  0.258203 1.986602 -1.072338
C  -1.86209 -1.087083 -0.589866
C  -0.938971 -2.137196 1.294869
C  3.830217 -0.210736 0.055211
C  2.717009 -1.52426 -1.627854
C  -2.058137 3.186621 -0.17886
C  -0.186668 3.158523 -1.665043
C  3.871212 -1.03748 -1.050193
C  -1.348123 3.762252 -1.218891
C  -2.618728 -3.078932 0.130149
H  2.571255 0.783054 1.454809
H  0.596818 -1.569734 -1.529349
H  1.167671 1.533055 -1.438387
H  -0.485729 0.567034 2.433446
H  -1.935235 -0.280714 -1.313292
H  -0.24158 -2.197074 2.123213
H  4.748285 0.156598 0.493158
H  2.769861 -2.174637 -2.49018
H  -2.968395 3.642361 0.185168
H  0.380618 3.594969 -2.475664
H  -1.707218 4.675712 -1.673108
H  -3.306314 -3.908148 0.006765
totalener: -1399.86915232 hartree
nucrepener: 1895.92630092 hartree
electener: -3295.79545324 hartree
oneelecener: -5682.38740584 hartree
twoeener: 2386.59195260 hartree
kineticenergy: 1395.40496371 hartree
xcener: -110.805675557018 hartree
chargesum: 0.0000000
charge: -0.080272 -0.200409 -0.352214 -0.279833 -0.282144 0.905327 -0.174794 -0.130873 -0.238607 -0.178650 -0.178463 -0.099535 -0.066398 0.024403 -0.024322 -0.160997 -0.156066 -0.122337 -0.137688 0.277187 -0.108449 0.146333 0.125944 0.140533 0.139145 0.189552 0.129778 0.128441 0.126865 0.126297 0.122671 0.131769 0.133751 0.124052
qa: -0.0803 -0.2004 -0.3522 -0.2798 -0.2821 0.9053 -0.1748 -0.1309 -0.2386 -0.1786 -0.1785 -0.0995 -0.0664 0.0244 -0.0243 -0.1610 -0.1561 -0.1223 -0.1377 0.2772 -0.1084 0.1463 0.1259 0.1405 0.1391 0.1896 0.1298 0.1284 0.1269 0.1263 0.1227 0.1318 0.1338 0.1241
va: 1.2573 1.0894 2.0494 3.0641 3.0592 3.0874 3.7957 3.6404 3.7457 4.0060 3.9022 4.0231 3.8391 4.0095 4.1402 3.8945 3.9283 4.0432 4.0149 3.9920 3.9575 4.0381 1.0419 1.0034 1.0057 1.0769 1.0077 1.0308 1.0073 1.0083 1.0124 1.0016 0.9979 0.9943
dispcorr: -0.019271407 hartree
energy: -1399.888423726979
dipole: 0.21367 -0.22790 -0.01422 3.74287 -2.34904 1.39384 -4.87023 4.49890 -0.37133
magnitude: 1.44252 au
magnitude: 3.66660 debye
