program: Orca
programVersion: 4.2.1
elementType: Cl F O N N C C C C C C C C C C C C C C C C C H H H H H H H H H H H H
charge: 0
multiplicity: 1
keywords: wb97x-d3
keywords: def2-TZVPP
keywords: def2/J RIJCOSX GRIDX6 NOFINALGRIDX
keywords: grid4 nofinalgrid
keywords: scfconv7
keywords: smallprint printgap noloewdin
keywords: NOSOSCF
formula: C17H12ClFN2O
InChI: InChI=1/C17H12ClFN2O/c18-16-4-2-1-3-15(16)17(22,13-9-20-11-21-10-13)12-5-7-14(19)8-6-12/h1-11,22H
34 atoms
Cl 0.973906 2.598896 1.30554
F  4.762939 -1.375358 -1.060521
O  -0.511172 -0.006281 2.05671
N  -3.24376 -2.623249 0.80552
N  -1.897232 -3.147314 -1.062985
C  -0.448137 -0.097434 0.654058
C  0.975674 -0.387836 0.181919
C  -0.987152 1.190139 0.009776
C  -1.333871 -1.286952 0.314221
C  1.468365 0.078685 -1.030674
C  1.788876 -1.205378 0.961197
C  -0.412588 2.437786 0.266877
C  -2.077308 1.178519 -0.855624
C  -2.449543 -1.60116 1.085527
C  -1.105501 -2.126098 -0.767614
C  2.74543 -0.251559 -1.459818
C  3.067926 -1.541062 0.550614
C  -0.895865 3.605154 -0.299546
C  -2.574111 2.337024 -1.433782
C  3.529186 -1.055777 -0.658039
C  -1.984288 3.555943 -1.154558
C  -2.927492 -3.343764 -0.258475
H  0.85751 0.712181 -1.660974
H  1.420161 -1.592202 1.901786
H  -2.558133 0.240477 -1.091831
H  0.071964 0.70087 2.35292
H  -2.710667 -1.011179 1.955485
H  -0.254497 -1.97532 -1.423085
H  3.127237 0.115965 -2.40261
H  3.699085 -2.174605 1.159143
H  -0.419499 4.548086 -0.06931
H  -3.423814 2.27892 -2.100188
H  -2.361831 4.468095 -1.596295
H  -3.57909 -4.178133 -0.493298
totalener: -1399.86952657 hartree
nucrepener: 1897.94415387 hartree
electener: -3297.81368045 hartree
oneelecener: -5686.44793334 hartree
twoeener: 2388.63425289 hartree
kineticenergy: 1395.39635810 hartree
xcener: -110.804230925466 hartree
chargesum: 0.0000000
charge: -0.079586 -0.200217 -0.354810 -0.283039 -0.282787 0.920456 -0.208934 -0.119069 -0.293798 -0.135257 -0.167802 -0.108873 -0.067211 0.006468 0.024661 -0.158124 -0.176961 -0.123931 -0.131389 0.285610 -0.109777 0.145864 0.135295 0.133510 0.145498 0.191031 0.124505 0.124690 0.126378 0.127301 0.121558 0.131426 0.133559 0.123754
qa: -0.0796 -0.2002 -0.3548 -0.2830 -0.2828 0.9205 -0.2089 -0.1191 -0.2938 -0.1353 -0.1678 -0.1089 -0.0672 0.0065 0.0247 -0.1581 -0.1770 -0.1239 -0.1314 0.2856 -0.1098 0.1459 0.1353 0.1335 0.1455 0.1910 0.1245 0.1247 0.1264 0.1273 0.1216 0.1314 0.1336 0.1238
va: 1.2572 1.0896 2.0493 3.0556 3.0716 3.0467 3.7354 3.6999 3.8011 3.8231 3.9994 4.0358 3.8204 4.1207 4.0620 3.9432 3.9310 4.0421 4.0115 3.9860 3.9573 4.0407 1.0042 1.0304 0.9987 1.0776 1.0355 1.0138 1.0062 1.0067 1.0131 1.0022 0.9979 0.9947
dispcorr: -0.019324582 hartree
energy: -1399.888851154736
dipole: -11.36997 11.33658 -0.03339 -0.39010 1.76519 1.37509 -4.14263 3.81756 -0.32507
magnitude: 1.41338 au
magnitude: 3.59253 debye
