program: Orca
programVersion: 5.0.2
elementType: N C C C C C C C C C C C C C C C C C C C C C H H H H H H H H H H H H H H H H H H H H H
charge: 0
multiplicity: 1
keywords: wb97x-d3
keywords: def2-TZVPP
keywords: def2/J RIJCOSX
keywords: DEFGRID2
keywords: scfconv7
keywords: smallprint printgap noloewdin
keywords: NOSOSCF
formula: C21H21N
InChI: InChI=1/C21H21N/c1-22(16-8-11-18-9-3-2-4-10-18)17-20-14-7-13-19-12-5-6-15-21(19)20/h2-15H,16-17H2,1H3
43 atoms
N  -2.1681 -1.034141 0.386127
C  -1.563761 -0.878097 -0.9322
C  -1.824432 0.466882 -1.552529
C  -1.158208 1.63825 -1.082868
C  -1.434084 2.887862 -1.702405
C  -1.574546 -2.168689 1.087771
C  -2.703395 0.576457 -2.599765
C  -3.603277 -1.196821 0.272415
C  -0.210978 1.610225 -0.029547
C  -2.354346 2.948386 -2.775581
C  -2.972917 1.814208 -3.217523
C  -0.775579 4.053098 -1.243189
C  -0.179791 -1.863172 1.526267
C  0.416012 2.753051 0.388252
C  0.12897 3.990998 -0.219806
C  0.896649 -2.526303 1.101654
C  2.291282 -2.240563 1.451965
C  2.690716 -1.048054 2.064527
C  3.273879 -3.181779 1.137197
C  4.023327 -0.81781 2.363805
C  4.608931 -2.952199 1.437457
C  4.989499 -1.768515 2.053447
H  -1.917455 -1.660996 -1.621555
H  -0.485973 -1.026444 -0.84098
H  -1.593756 -3.089075 0.482942
H  -2.187615 -2.364218 1.972214
H  -3.205053 -0.313019 -2.962438
H  -4.050796 -0.326231 -0.207152
H  -4.049767 -1.285819 1.263374
H  -3.895013 -2.083628 -0.310028
H  0.028513 0.673465 0.455061
H  -2.553277 3.905293 -3.242835
H  -3.670834 1.857434 -4.043473
H  -0.998362 4.999305 -1.721559
H  -0.076897 -1.034851 2.22158
H  1.13782 2.706323 1.193397
H  0.626566 4.888379 0.12396
H  0.751579 -3.362232 0.421771
H  1.959277 -0.284363 2.298952
H  2.985266 -4.106512 0.651389
H  4.312234 0.113307 2.834123
H  5.351919 -3.697958 1.186329
H  6.030302 -1.58314 2.284446
elementType: N C H
totalener: -867.67345736 hartree
nucrepener: 1629.21257733 hartree
electener: -2496.88603469 hartree
oneelecener: -4408.78600090 hartree
twoeener: 1911.89996621 hartree
cpcmener: -0.02243103 hartree
kineticenergy: 863.62487124 hartree
xcener: -88.218579540338 hartree
chargesum: 0.0000000
charge: -0.238254 -0.024360 0.033399 -0.084540 -0.031831 -0.042320 -0.164343 -0.217199 -0.190818 -0.146995 -0.135683 -0.116344 -0.134743 -0.180920 -0.146069 -0.095575 0.072197 -0.219834 -0.190188 -0.157261 -0.161464 -0.164068 0.112055 0.126674 0.084903 0.100614 0.135349 0.105923 0.104218 0.080890 0.137234 0.144619 0.158280 0.144216 0.108387 0.154648 0.160100 0.119393 0.139237 0.141261 0.159341 0.158866 0.161005
qa: -0.2383 -0.0244 0.0334 -0.0845 -0.0318 -0.0423 -0.1643 -0.2172 -0.1908 -0.1470 -0.1357 -0.1163 -0.1347 -0.1809 -0.1461 -0.0956 0.0722 -0.2198 -0.1902 -0.1573 -0.1615 -0.1641 0.1121 0.1267 0.0849 0.1006 0.1353 0.1059 0.1042 0.0809 0.1372 0.1446 0.1583 0.1442 0.1084 0.1546 0.1601 0.1194 0.1392 0.1413 0.1593 0.1589 0.1610
va: 2.7783 3.6380 3.4872 3.8774 3.8459 3.9390 3.9099 3.9702 3.9443 3.9276 3.8974 3.8832 3.8073 3.9505 3.8887 3.7849 3.6400 3.9442 3.9472 3.9132 3.8921 3.8920 1.0167 0.9905 1.0091 0.9947 1.0105 0.9907 0.9978 1.0014 0.9946 1.0047 0.9902 1.0051 1.0219 0.9944 0.9895 1.0173 1.0087 1.0084 0.9916 0.9910 0.9892
dispcorr: -0.019325388 hartree
energy: -867.692782752317
dipole: -5.15163 4.97976 -0.17187 -6.88843 6.42275 -0.46568 2.13898 -2.31125 -0.17226
magnitude: 0.52542 au
magnitude: 1.33552 debye
