program: Orca
programVersion: 5.0.2
elementType: N C C C C C C C C C C C C C C C C C C C C C H H H H H H H H H H H H H H H H H H H H H
charge: 0
multiplicity: 1
keywords: wb97x-d3
keywords: def2-TZVPP
keywords: def2/J RIJCOSX
keywords: DEFGRID2
keywords: scfconv7
keywords: smallprint printgap noloewdin
keywords: NOSOSCF
formula: C21H21N
InChI: InChI=1/C21H21N/c1-22(16-8-11-18-9-3-2-4-10-18)17-20-14-7-13-19-12-5-6-15-21(19)20/h2-15H,16-17H2,1H3
43 atoms
N  -2.933823 -0.92683 0.731848
C  -3.086666 -0.131317 -0.483352
C  -1.80679 0.231479 -1.188409
C  -0.860262 1.13752 -0.625991
C  0.345638 1.404834 -1.327227
C  -2.206261 -2.171875 0.495022
C  -1.545277 -0.322709 -2.4157
C  -4.255701 -1.21725 1.255093
C  -1.056581 1.763905 0.626885
C  0.57097 0.803314 -2.588109
C  -0.360465 -0.037788 -3.124276
C  1.317616 2.25196 -0.744803
C  -0.724311 -1.981562 0.31517
C  -0.102539 2.586864 1.163484
C  1.103814 2.82749 0.477065
C  0.058452 -1.437825 1.247852
C  1.474352 -1.090315 1.107625
C  2.101654 -0.406933 2.152292
C  2.219263 -1.346665 -0.048844
C  3.418354 0.018417 2.046732
C  3.532683 -0.92268 -0.155953
C  4.139575 -0.233551 0.889045
H  -3.627481 0.7805 -0.213043
H  -3.726603 -0.65905 -1.208982
H  -2.615332 -2.717483 -0.369118
H  -2.37975 -2.812987 1.363267
H  -2.261835 -1.009867 -2.849751
H  -4.178059 -1.760811 2.197175
H  -4.875433 -1.816363 0.570952
H  -4.790845 -0.287647 1.453927
H  -1.969477 1.585662 1.176411
H  1.493296 1.01708 -3.11483
H  -0.192018 -0.498938 -4.088672
H  2.239301 2.434588 -1.284185
H  -0.30612 -2.283283 -0.638612
H  -0.273028 3.052756 2.125462
H  1.855511 3.469225 0.917542
H  -0.386568 -1.143096 2.194179
H  1.541122 -0.193174 3.05487
H  1.768448 -1.866763 -0.884583
H  3.877251 0.552967 2.868415
H  4.086666 -1.125479 -1.063544
H  5.164263 0.102153 0.798424
elementType: N C H
totalener: -867.66568094 hartree
nucrepener: 1774.08813485 hartree
electener: -2641.75381580 hartree
oneelecener: -4699.55718101 hartree
twoeener: 2057.80336522 hartree
cpcmener: -0.02286959 hartree
kineticenergy: 863.63589933 hartree
xcener: -88.225666681801 hartree
chargesum: -0.0000000
charge: -0.223936 -0.099427 0.190227 -0.048831 -0.019641 -0.057782 -0.174902 -0.203511 -0.258898 -0.191448 -0.122290 -0.121981 -0.097299 -0.140985 -0.176594 -0.149284 0.119242 -0.215685 -0.256666 -0.154373 -0.147836 -0.164999 0.116264 0.108265 0.100980 0.108505 0.129427 0.100000 0.079652 0.100437 0.134377 0.140971 0.157337 0.141161 0.129883 0.157121 0.157992 0.100652 0.139435 0.138381 0.157499 0.157874 0.160690
qa: -0.2239 -0.0994 0.1902 -0.0488 -0.0196 -0.0578 -0.1749 -0.2035 -0.2589 -0.1914 -0.1223 -0.1220 -0.0973 -0.1410 -0.1766 -0.1493 0.1192 -0.2157 -0.2567 -0.1544 -0.1478 -0.1650 0.1163 0.1083 0.1010 0.1085 0.1294 0.1000 0.0797 0.1004 0.1344 0.1410 0.1573 0.1412 0.1299 0.1571 0.1580 0.1007 0.1394 0.1384 0.1575 0.1579 0.1607
va: 2.7844 3.8077 3.3864 3.7202 3.7145 3.9108 3.8853 3.9460 3.9436 3.9082 3.8640 3.7949 3.7765 3.8750 3.8580 3.8055 3.5036 3.9112 3.9315 3.8673 3.8714 3.8788 0.9940 1.0073 1.0112 0.9958 1.0108 0.9976 1.0006 0.9953 1.0334 1.0055 0.9894 1.0067 1.0000 0.9906 0.9905 1.0388 1.0117 1.0157 0.9909 0.9917 0.9887
dispcorr: -0.025790867 hartree
energy: -867.691471811637
dipole: -9.02659 8.49585 -0.53074 -5.03761 4.76784 -0.26977 2.67588 -2.98031 -0.30443
magnitude: 0.66868 au
magnitude: 1.69966 debye
