program: Orca
programVersion: 5.0.2
elementType: N C C C C C C C C C C C C C C C C C C C C C H H H H H H H H H H H H H H H H H H H H H
charge: 0
multiplicity: 1
keywords: wb97x-d3
keywords: def2-TZVPP
keywords: def2/J RIJCOSX
keywords: DEFGRID2
keywords: scfconv7
keywords: smallprint printgap noloewdin
keywords: NOSOSCF
formula: C21H21N
InChI: InChI=1/C21H21N/c1-22(16-8-11-18-9-3-2-4-10-18)17-20-14-7-13-19-12-5-6-15-21(19)20/h2-15H,16-17H2,1H3
43 atoms
N  -1.886539 -1.343845 -0.452648
C  -1.832969 -0.222936 0.479257
C  -2.163825 1.098914 -0.156517
C  -1.240079 1.751104 -1.026699
C  -1.593112 3.003164 -1.599877
C  -1.250436 -2.520236 0.131898
C  -3.363388 1.70606 0.115497
C  -3.25944 -1.644504 -0.807025
C  0.033619 1.211374 -1.333343
C  -2.846169 3.584104 -1.292866
C  -3.711305 2.950067 -0.447972
C  -0.680368 3.656928 -2.461253
C  0.226145 -2.344963 0.272947
C  0.899558 1.871184 -2.162893
C  0.539206 3.105188 -2.739641
C  0.869204 -2.426615 1.438552
C  2.306479 -2.246987 1.664163
C  2.84552 -2.618394 2.898091
C  3.164894 -1.696274 0.706862
C  4.197597 -2.460615 3.16633
C  4.514492 -1.536857 0.974734
C  5.039004 -1.920422 2.204246
H  -0.829212 -0.173236 0.905365
H  -2.513734 -0.385599 1.329745
H  -1.442019 -3.361993 -0.540414
H  -1.6930 -2.789875 1.104445
H  -4.062627 1.21659 0.783242
H  -3.289317 -2.473712 -1.514704
H  -3.728674 -0.788379 -1.291486
H  -3.8799 -1.918066 0.059608
H  0.33429 0.265034 -0.905217
H  -3.102653 4.540501 -1.732292
H  -4.666952 3.396573 -0.206629
H  -0.964562 4.608224 -2.895053
H  0.770163 -2.142589 -0.645473
H  1.869212 1.441738 -2.379066
H  1.230758 3.613754 -3.398423
H  0.286931 -2.648397 2.329544
H  2.194183 -3.037421 3.656017
H  2.776852 -1.37389 -0.251479
H  4.592302 -2.757693 4.129309
H  5.161069 -1.103392 0.222712
H  6.093181 -1.790495 2.411124
elementType: N C H
totalener: -867.67346267 hartree
nucrepener: 1619.77730342 hartree
electener: -2487.45076609 hartree
oneelecener: -4389.87408489 hartree
twoeener: 1902.42331880 hartree
cpcmener: -0.02238564 hartree
kineticenergy: 863.62490170 hartree
xcener: -88.218162256402 hartree
chargesum: 0.0000000
charge: -0.233598 -0.018488 0.038100 -0.074570 -0.032789 -0.042153 -0.167335 -0.218117 -0.210137 -0.149582 -0.135163 -0.113179 -0.147459 -0.177439 -0.150272 -0.083783 0.059696 -0.183949 -0.212861 -0.165895 -0.162322 -0.161048 0.122444 0.112139 0.101323 0.082770 0.135022 0.105002 0.106398 0.081083 0.142477 0.144710 0.158480 0.144024 0.109799 0.155912 0.160206 0.117226 0.141561 0.142572 0.159025 0.159010 0.161159
qa: -0.2336 -0.0185 0.0381 -0.0746 -0.0328 -0.0422 -0.1673 -0.2181 -0.2101 -0.1496 -0.1352 -0.1132 -0.1475 -0.1774 -0.1503 -0.0838 0.0597 -0.1839 -0.2129 -0.1659 -0.1623 -0.1610 0.1224 0.1121 0.1013 0.0828 0.1350 0.1050 0.1064 0.0811 0.1425 0.1447 0.1585 0.1440 0.1098 0.1559 0.1602 0.1172 0.1416 0.1426 0.1590 0.1590 0.1612
va: 2.7885 3.6352 3.4741 3.8567 3.8507 3.9442 3.9140 3.9683 3.9574 3.9273 3.8969 3.8804 3.8315 3.9483 3.8891 3.7934 3.6600 3.9426 3.9424 3.8956 3.9134 3.8890 0.9925 1.0162 0.9940 1.0097 1.0109 0.9979 0.9910 1.0020 0.9962 1.0045 0.9902 1.0050 1.0208 0.9935 0.9894 1.0190 1.0084 1.0074 0.9911 0.9919 0.9893
dispcorr: -0.018946791 hartree
energy: -867.692409459335
dipole: -4.64457 4.36449 -0.28008 -7.26937 7.02692 -0.24245 1.42964 -1.06725 0.36239
magnitude: 0.51822 au
magnitude: 1.31721 debye
