program: Orca
programVersion: 5.0.2
elementType: N C C C C C C C C C C C C C C C C C C C C C H H H H H H H H H H H H H H H H H H H H H
charge: 0
multiplicity: 1
keywords: wb97x-d3
keywords: def2-TZVPP
keywords: def2/J RIJCOSX
keywords: DEFGRID2
keywords: scfconv7
keywords: smallprint printgap noloewdin
keywords: NOSOSCF
formula: C21H21N
InChI: InChI=1/C21H21N/c1-22(16-8-11-18-9-3-2-4-10-18)17-20-14-7-13-19-12-5-6-15-21(19)20/h2-15H,16-17H2,1H3
43 atoms
N  -1.479844 -0.052049 1.230323
C  -0.859018 1.265053 1.133098
C  -0.791385 1.815854 -0.265465
C  -1.965194 2.179997 -0.989344
C  -1.835523 2.680024 -2.314424
C  -0.904188 -1.050562 0.334287
C  0.43371 1.984958 -0.859891
C  -1.459127 -0.495303 2.609721
C  -3.265361 2.085183 -0.436118
C  -0.549602 2.821713 -2.886735
C  0.563003 2.489432 -2.168955
C  -2.995371 3.040557 -3.039684
C  0.551137 -1.357866 0.530828
C  -4.369356 2.447304 -1.160423
C  -4.236963 2.924776 -2.479201
C  0.994108 -2.511483 1.033802
C  2.392587 -2.899339 1.243478
C  2.666531 -4.07634 1.944013
C  3.472891 -2.147078 0.770016
C  3.971838 -4.485636 2.176652
C  4.775841 -2.55537 1.000785
C  5.03323 -3.725824 1.70648
H  0.160067 1.267039 1.547787
H  -1.436374 1.943271 1.769098
H  -1.06421 -0.717577 -0.694904
H  -1.485565 -1.968231 0.452863
H  1.329237 1.72135 -0.309688
H  -1.937628 -1.471762 2.696435
H  -2.02268 0.203286 3.230555
H  -0.451286 -0.578524 3.03928
H  -3.391489 1.720336 0.572761
H  -0.463509 3.205207 -3.896147
H  1.548723 2.606283 -2.59979
H  -2.881193 3.415382 -4.049732
H  1.258265 -0.585856 0.241835
H  -5.353332 2.367082 -0.717071
H  -5.118032 3.20421 -3.041856
H  0.261383 -3.258282 1.33098
H  1.843323 -4.677167 2.312338
H  3.2996 -1.237379 0.208981
H  4.158311 -5.400826 2.723521
H  5.597104 -1.959398 0.624175
H  6.052744 -4.042729 1.882839
elementType: N C H
totalener: -867.67077063 hartree
nucrepener: 1606.15728530 hartree
electener: -2473.82805593 hartree
oneelecener: -4362.47917513 hartree
twoeener: 1888.65111920 hartree
cpcmener: -0.02190054 hartree
kineticenergy: 863.62528746 hartree
xcener: -88.220795649020 hartree
chargesum: 0.0000000
charge: -0.213778 -0.069813 0.115663 -0.097302 -0.036790 -0.058344 -0.142143 -0.212536 -0.247706 -0.149396 -0.160452 -0.096329 -0.137797 -0.160144 -0.158132 -0.124795 0.067202 -0.178983 -0.220295 -0.167296 -0.160624 -0.163414 0.110157 0.115735 0.104683 0.106991 0.142432 0.103327 0.106139 0.080257 0.140010 0.144932 0.157533 0.144055 0.113313 0.158306 0.159994 0.115451 0.142898 0.145773 0.159282 0.160238 0.161700
qa: -0.2138 -0.0698 0.1157 -0.0973 -0.0368 -0.0583 -0.1421 -0.2125 -0.2477 -0.1494 -0.1605 -0.0963 -0.1378 -0.1601 -0.1581 -0.1248 0.0672 -0.1790 -0.2203 -0.1673 -0.1606 -0.1634 0.1102 0.1157 0.1047 0.1070 0.1424 0.1033 0.1061 0.0803 0.1400 0.1449 0.1575 0.1441 0.1133 0.1583 0.1600 0.1155 0.1429 0.1458 0.1593 0.1602 0.1617
va: 2.7893 3.7433 3.4358 3.8225 3.8558 3.9799 3.8790 3.9474 3.9736 3.9282 3.9277 3.8633 3.7366 3.9303 3.9038 3.8711 3.6698 3.9360 3.9591 3.8981 3.9017 3.8877 0.9981 0.9940 0.9943 1.0021 1.0016 0.9960 0.9971 0.9959 1.0324 1.0042 0.9916 1.0046 1.0113 0.9925 0.9892 1.0214 1.0075 1.0083 0.9910 0.9912 0.9891
dispcorr: -0.019006066 hartree
energy: -867.689776695156
dipole: -0.00806 0.37511 0.36705 -3.99301 3.97230 -0.02071 6.93392 -6.74849 0.18543
magnitude: 0.41175 au
magnitude: 1.04659 debye
