program: Orca
programVersion: 5.0.2
elementType: N C C C C C C C C C C C C C C C C C C C C C H H H H H H H H H H H H H H H H H H H H H
charge: 0
multiplicity: 1
keywords: wb97x-d3
keywords: def2-TZVPP
keywords: def2/J RIJCOSX
keywords: DEFGRID2
keywords: scfconv7
keywords: smallprint printgap noloewdin
keywords: NOSOSCF
formula: C21H21N
InChI: InChI=1/C21H21N/c1-22(16-8-11-18-9-3-2-4-10-18)17-20-14-7-13-19-12-5-6-15-21(19)20/h2-15H,16-17H2,1H3
43 atoms
N  -1.492077 -0.632963 0.494113
C  -2.649186 -0.296164 -0.328489
C  -2.36033 0.757275 -1.362949
C  -2.101693 2.110207 -0.992562
C  -1.78223 3.056692 -2.003985
C  -0.43955 -1.2534 -0.298051
C  -2.331796 0.414381 -2.690866
C  -1.904585 -1.507693 1.574493
C  -2.162144 2.561037 0.348822
C  -1.754565 2.649866 -3.358385
C  -2.035326 1.356902 -3.6952
C  -1.501997 4.395378 -1.641791
C  0.835143 -1.379373 0.468738
C  -1.901605 3.866415 0.667324
C  -1.554745 4.793559 -0.33519
C  1.5166 -2.517986 0.602809
C  2.784768 -2.703232 1.315272
C  3.488788 -1.652634 1.913963
C  3.316903 -3.99089 1.415043
C  4.672649 -1.887699 2.59234
C  4.503824 -4.227379 2.094148
C  5.187098 -3.176203 2.687536
H  -3.441626 0.050504 0.340161
H  -3.05088 -1.186655 -0.837559
H  -0.247639 -0.616918 -1.166761
H  -0.74526 -2.236442 -0.693739
H  -2.535172 -0.611019 -2.975915
H  -1.064748 -1.726021 2.23391
H  -2.311592 -2.468224 1.223709
H  -2.673066 -1.020782 2.175977
H  -2.424037 1.868996 1.136603
H  -1.51162 3.380212 -4.120635
H  -2.021692 1.045338 -4.731286
H  -1.247488 5.102756 -2.421912
H  1.207159 -0.458987 0.909561
H  -1.956893 4.189863 1.698567
H  -1.338359 5.819435 -0.067653
H  1.105536 -3.419396 0.155368
H  3.113879 -0.638966 1.852547
H  2.789039 -4.818632 0.956263
H  5.199334 -1.059772 3.049093
H  4.894194 -5.234725 2.158927
H  6.113038 -3.355496 3.217986
elementType: N C H
totalener: -867.67299072 hartree
nucrepener: 1584.16835049 hartree
electener: -2451.84134122 hartree
oneelecener: -4318.72014609 hartree
twoeener: 1866.87880488 hartree
cpcmener: -0.02174045 hartree
kineticenergy: 863.62747374 hartree
xcener: -88.218687569485 hartree
chargesum: -0.0000000
charge: -0.225534 -0.040365 0.106236 -0.106449 -0.046858 -0.059071 -0.147752 -0.204921 -0.261721 -0.156227 -0.136248 -0.092082 -0.147916 -0.148954 -0.162917 -0.084740 0.048385 -0.218016 -0.174184 -0.167005 -0.170762 -0.158382 0.117793 0.108605 0.113180 0.090449 0.134808 0.104830 0.082522 0.102338 0.143084 0.144597 0.158451 0.143806 0.111244 0.158465 0.159721 0.114341 0.145833 0.141988 0.159002 0.158822 0.161606
qa: -0.2255 -0.0404 0.1062 -0.1064 -0.0469 -0.0591 -0.1478 -0.2049 -0.2617 -0.1562 -0.1362 -0.0921 -0.1479 -0.1490 -0.1629 -0.0847 0.0484 -0.2180 -0.1742 -0.1670 -0.1708 -0.1584 0.1178 0.1086 0.1132 0.0904 0.1348 0.1048 0.0825 0.1023 0.1431 0.1446 0.1585 0.1438 0.1112 0.1585 0.1597 0.1143 0.1458 0.1420 0.1590 0.1588 0.1616
va: 2.7794 3.7093 3.4699 3.8535 3.8534 3.9181 3.8868 3.9424 3.9912 3.9322 3.8978 3.8611 3.8628 3.9201 3.9073 3.8528 3.6915 3.9522 3.9282 3.9061 3.9019 3.8818 0.9926 1.0090 0.9919 1.0152 1.0102 0.9941 1.0027 0.9971 1.0201 1.0046 0.9903 1.0047 1.0292 0.9921 0.9895 1.0233 1.0100 1.0085 0.9918 0.9914 0.9890
dispcorr: -0.017845515 hartree
energy: -867.690836238681
dipole: -1.94568 1.64179 -0.30390 -6.94972 6.60633 -0.34340 3.93120 -4.08511 -0.15391
magnitude: 0.48370 au
magnitude: 1.22946 debye
