program: Orca
programVersion: 5.0.2
elementType: N C C C C C C C C C C C C C C C C C C C C C H H H H H H H H H H H H H H H H H H H H H
charge: 0
multiplicity: 1
keywords: wb97x-d3
keywords: def2-TZVPP
keywords: def2/J RIJCOSX
keywords: DEFGRID2
keywords: scfconv7
keywords: smallprint printgap noloewdin
keywords: NOSOSCF
formula: C21H21N
InChI: InChI=1/C21H21N/c1-22(16-8-11-18-9-3-2-4-10-18)17-20-14-7-13-19-12-5-6-15-21(19)20/h2-15H,16-17H2,1H3
43 atoms
N  -2.701693 -1.740688 -0.27505
C  -2.088411 -0.940396 -1.329259
C  -2.069571 0.53774 -1.022662
C  -0.875831 1.318974 -1.062587
C  -0.946852 2.705339 -0.739615
C  -2.015511 -1.610117 1.007245
C  -3.255838 1.155536 -0.706751
C  -2.793911 -3.122797 -0.705568
C  0.395142 0.791589 -1.410588
C  -2.190272 3.287477 -0.409992
C  -3.324768 2.526143 -0.402252
C  0.231675 3.490136 -0.751772
C  -0.555936 -1.956358 1.005813
C  1.515241 1.576485 -1.419649
C  1.43878 2.942118 -1.080812
C  0.392792 -1.086355 1.356272
C  1.841454 -1.308806 1.363743
C  2.684331 -0.205587 1.522213
C  2.426934 -2.568286 1.199586
C  4.064093 -0.347954 1.500635
C  3.80461 -2.711728 1.180381
C  4.630765 -1.602792 1.327473
H  -2.680296 -1.094552 -2.236115
H  -1.084706 -1.305711 -1.573251
H  -2.541375 -2.254988 1.717871
H  -2.142548 -0.587962 1.371648
H  -4.168768 0.574536 -0.689733
H  -1.829917 -3.582765 -0.961755
H  -3.428898 -3.192946 -1.590119
H  -3.253082 -3.726485 0.077948
H  0.495761 -0.250647 -1.675964
H  -2.229205 4.343394 -0.171316
H  -4.281213 2.971211 -0.16069
H  0.156714 4.540013 -0.494869
H  -0.288259 -2.961619 0.692593
H  2.470245 1.142887 -1.686256
H  2.333419 3.550743 -1.086219
H  0.085411 -0.083105 1.641534
H  2.248762 0.777698 1.656238
H  1.805314 -3.448153 1.090204
H  4.695999 0.522619 1.619585
H  4.237775 -3.695359 1.052233
H  5.706498 -1.719125 1.310682
elementType: N C H
totalener: -867.66931135 hartree
nucrepener: 1692.68324816 hartree
electener: -2560.35255951 hartree
oneelecener: -4535.79214281 hartree
twoeener: 1975.43958331 hartree
cpcmener: -0.02061747 hartree
kineticenergy: 863.62522991 hartree
xcener: -88.224396292975 hartree
chargesum: 0.0000000
charge: -0.210135 -0.079848 0.134560 -0.081181 -0.016600 -0.050322 -0.218500 -0.209981 -0.241385 -0.151898 -0.137249 -0.088623 -0.127164 -0.163792 -0.156594 -0.133627 0.087308 -0.213529 -0.221924 -0.158593 -0.156914 -0.161249 0.117560 0.106223 0.106798 0.097186 0.125016 0.079076 0.101619 0.103092 0.149068 0.143519 0.159104 0.142890 0.127605 0.156665 0.159286 0.118078 0.142373 0.142769 0.158332 0.159593 0.161392
qa: -0.2101 -0.0798 0.1346 -0.0812 -0.0166 -0.0503 -0.2185 -0.2100 -0.2414 -0.1519 -0.1372 -0.0886 -0.1272 -0.1638 -0.1566 -0.1336 0.0873 -0.2135 -0.2219 -0.1586 -0.1569 -0.1612 0.1176 0.1062 0.1068 0.0972 0.1250 0.0791 0.1016 0.1031 0.1491 0.1435 0.1591 0.1429 0.1276 0.1567 0.1593 0.1181 0.1424 0.1428 0.1583 0.1596 0.1614
va: 2.8439 3.8303 3.4354 3.6912 3.8521 3.9460 3.9485 3.9564 3.8681 3.9305 3.8989 3.8639 3.7404 3.8718 3.8938 3.8518 3.5594 3.9139 3.9696 3.8929 3.8974 3.8910 0.9934 1.0005 0.9975 0.9999 1.0326 0.9938 0.9955 0.9963 1.0098 1.0052 0.9898 1.0050 1.0021 0.9939 0.9893 1.0137 1.0068 1.0105 0.9915 0.9910 0.9888
dispcorr: -0.022149028 hartree
energy: -867.691460374464
dipole: -3.35409 3.63464 0.28055 -8.94068 8.56331 -0.37737 -0.16799 0.03979 -0.12820
magnitude: 0.48739 au
magnitude: 1.23884 debye
