program: Orca
programVersion: 5.0.2
elementType: N C C C C C C C C C C C C C C C C C C C C C H H H H H H H H H H H H H H H H H H H H H
charge: 0
multiplicity: 1
keywords: wb97x-d3
keywords: def2-TZVPP
keywords: def2/J RIJCOSX
keywords: DEFGRID2
keywords: scfconv7
keywords: smallprint printgap noloewdin
keywords: NOSOSCF
formula: C21H21N
InChI: InChI=1/C21H21N/c1-22(16-8-11-18-9-3-2-4-10-18)17-20-14-7-13-19-12-5-6-15-21(19)20/h2-15H,16-17H2,1H3
43 atoms
N  -3.157322 -1.410153 0.199932
C  -2.761857 -0.004364 0.268017
C  -1.911544 0.460389 -0.887833
C  -0.72448 1.231198 -0.688951
C  0.061189 1.593826 -1.819483
C  -2.027433 -2.321212 0.003317
C  -2.28335 0.13567 -2.168717
C  -3.90658 -1.740673 1.397951
C  -0.2653 1.647544 0.587044
C  -0.358685 1.219825 -3.115868
C  -1.514733 0.513217 -3.285661
C  1.2622 2.320685 -1.635858
C  -0.818077 -2.016669 0.835007
C  0.896115 2.355711 0.733871
C  1.676506 2.694189 -0.38867
C  0.35801 -1.724642 0.277497
C  1.578371 -1.261209 0.939089
C  1.688057 -1.092848 2.323176
C  2.661882 -0.885806 0.141451
C  2.834951 -0.554476 2.8815
C  3.811492 -0.345909 0.699728
C  3.901338 -0.173679 2.073228
H  -2.260281 0.208075 1.218231
H  -3.679806 0.59139 0.288926
H  -1.737609 -2.313929 -1.050104
H  -2.39454 -3.330355 0.209297
H  -3.185124 -0.440208 -2.330993
H  -4.259466 -2.77084 1.347967
H  -4.784138 -1.096833 1.475843
H  -3.335067 -1.625036 2.329619
H  -0.831657 1.403015 1.474301
H  0.247787 1.504525 -3.967153
H  -1.844695 0.233308 -4.277578
H  1.850469 2.575698 -2.509195
H  -0.948406 -1.978012 1.91314
H  1.221563 2.651732 1.722635
H  2.59858 3.245502 -0.259383
H  0.423834 -1.76624 -0.807332
H  0.86697 -1.370452 2.972092
H  2.592393 -1.001846 -0.933753
H  2.897918 -0.425534 3.954306
H  4.634455 -0.054965 0.059751
H  4.792803 0.253698 2.513115
elementType: N C H
totalener: -867.66652055 hartree
nucrepener: 1748.54835736 hartree
electener: -2616.21487790 hartree
oneelecener: -4647.85713214 hartree
twoeener: 2031.64225424 hartree
cpcmener: -0.02230056 hartree
kineticenergy: 863.63445202 hartree
xcener: -88.228864132141 hartree
chargesum: 0.0000000
charge: -0.211328 -0.093770 0.164736 -0.064488 -0.003768 -0.050227 -0.249612 -0.206783 -0.243238 -0.170732 -0.117158 -0.088294 -0.130890 -0.155762 -0.176941 -0.116900 0.081361 -0.223975 -0.197655 -0.154057 -0.171337 -0.153034 0.101362 0.116309 0.097201 0.106362 0.130017 0.100004 0.100663 0.081483 0.150690 0.144093 0.157999 0.140941 0.127919 0.155132 0.157847 0.105887 0.140985 0.140460 0.159412 0.158394 0.160694
qa: -0.2113 -0.0938 0.1647 -0.0645 -0.0038 -0.0502 -0.2496 -0.2068 -0.2432 -0.1707 -0.1172 -0.0883 -0.1309 -0.1558 -0.1769 -0.1169 0.0814 -0.2240 -0.1977 -0.1541 -0.1713 -0.1530 0.1014 0.1163 0.0972 0.1064 0.1300 0.1000 0.1007 0.0815 0.1507 0.1441 0.1580 0.1409 0.1279 0.1551 0.1578 0.1059 0.1410 0.1405 0.1594 0.1584 0.1607
va: 2.8645 3.8682 3.3998 3.6865 3.7804 3.9326 3.9282 3.9561 3.8678 3.9436 3.8849 3.8281 3.7170 3.8451 3.8668 3.8594 3.5674 3.9360 3.8856 3.8833 3.8675 3.8707 1.0005 0.9940 0.9973 0.9990 1.0309 0.9983 0.9938 0.9960 1.0073 1.0046 0.9896 1.0053 1.0029 0.9943 0.9911 1.0178 1.0118 1.0096 0.9906 0.9917 0.9885
dispcorr: -0.024754361 hartree
energy: -867.691274907515
dipole: -6.60934 6.65105 0.04170 -5.12854 5.13671 0.00817 5.13680 -4.61226 0.52454
magnitude: 0.52626 au
magnitude: 1.33765 debye
