program: Orca
programVersion: 5.0.2
elementType: N C C C C C C C C C C C C C C C C C C C C C H H H H H H H H H H H H H H H H H H H H H
charge: 0
multiplicity: 1
keywords: wb97x-d3
keywords: def2-TZVPP
keywords: def2/J RIJCOSX
keywords: DEFGRID2
keywords: scfconv7
keywords: smallprint printgap noloewdin
keywords: NOSOSCF
formula: C21H21N
InChI: InChI=1/C21H21N/c1-22(16-8-11-18-9-3-2-4-10-18)17-20-14-7-13-19-12-5-6-15-21(19)20/h2-15H,16-17H2,1H3
43 atoms
N  -2.890309 -1.545907 0.068156
C  -2.274791 -0.97545 -1.124569
C  -2.062896 0.516059 -1.034319
C  -0.79394 1.129606 -1.257866
C  -0.68182 2.54573 -1.144311
C  -2.131478 -1.28195 1.28659
C  -3.141268 1.313206 -0.733428
C  -3.12141 -2.962778 -0.135123
C  0.381156 0.403467 -1.585182
C  -1.819964 3.317227 -0.823555
C  -3.027834 2.709897 -0.624672
C  0.572665 3.169692 -1.350981
C  -0.692101 -1.704168 1.273416
C  1.578952 1.034251 -1.778925
C  1.681222 2.434673 -1.660883
C  0.307155 -0.848904 1.497289
C  1.74293 -1.139874 1.507384
C  2.263933 -2.436517 1.453442
C  2.640883 -0.070637 1.562583
C  3.632442 -2.650929 1.451178
C  4.011706 -0.284384 1.558092
C  4.514073 -1.576718 1.503227
H  -2.948739 -1.175636 -1.962723
H  -1.342271 -1.49254 -1.376729
H  -2.652357 -1.793584 2.10163
H  -2.18744 -0.21485 1.514697
H  -4.109529 0.857291 -0.572013
H  -3.800744 -3.109835 -0.97625
H  -3.594455 -3.392676 0.748282
H  -2.213515 -3.544251 -0.346491
H  0.345409 -0.67163 -1.681686
H  -1.719599 4.392687 -0.740898
H  -3.903141 3.298545 -0.383005
H  0.636191 4.24732 -1.259448
H  -0.484159 -2.750936 1.069444
H  2.45789 0.451505 -2.021622
H  2.635156 2.920962 -1.817271
H  0.05408 0.193491 1.675501
H  1.598303 -3.289982 1.420856
H  2.25605 0.941746 1.603811
H  4.014745 -3.662703 1.411451
H  4.68724 0.560154 1.600534
H  5.582488 -1.748187 1.503961
elementType: N C H
totalener: -867.66915757 hartree
nucrepener: 1698.96243185 hartree
electener: -2566.63158942 hartree
oneelecener: -4548.41897013 hartree
twoeener: 1981.78738071 hartree
cpcmener: -0.02086090 hartree
kineticenergy: 863.62913150 hartree
xcener: -88.225520842199 hartree
chargesum: -0.0000000
charge: -0.211882 -0.081458 0.148632 -0.088764 -0.011970 -0.048272 -0.224191 -0.208612 -0.238258 -0.152583 -0.132271 -0.093557 -0.123779 -0.171700 -0.151155 -0.127956 0.083971 -0.218405 -0.223270 -0.156608 -0.151646 -0.163316 0.117738 0.104203 0.105643 0.096522 0.125513 0.101025 0.102270 0.079148 0.147440 0.143520 0.158352 0.142568 0.128853 0.157285 0.159567 0.114645 0.142076 0.140849 0.159471 0.158971 0.161394
qa: -0.2119 -0.0815 0.1486 -0.0888 -0.0120 -0.0483 -0.2242 -0.2086 -0.2383 -0.1526 -0.1323 -0.0936 -0.1238 -0.1717 -0.1512 -0.1280 0.0840 -0.2184 -0.2233 -0.1566 -0.1516 -0.1633 0.1177 0.1042 0.1056 0.0965 0.1255 0.1010 0.1023 0.0791 0.1474 0.1435 0.1584 0.1426 0.1289 0.1573 0.1596 0.1146 0.1421 0.1408 0.1595 0.1590 0.1614
va: 2.8497 3.8357 3.4262 3.6833 3.8398 3.9464 3.9388 3.9574 3.8612 3.9335 3.8952 3.8643 3.7337 3.8772 3.8894 3.8553 3.5652 3.9647 3.9127 3.8993 3.8885 3.8933 0.9934 1.0008 0.9976 0.9995 1.0326 0.9950 0.9969 0.9945 1.0093 1.0051 0.9900 1.0053 1.0020 0.9936 0.9888 1.0147 1.0111 1.0098 0.9912 0.9909 0.9890
dispcorr: -0.022341108 hartree
energy: -867.691498682617
dipole: -4.26253 4.49566 0.23313 -8.50609 8.08400 -0.42209 1.38124 -1.43950 -0.05826
magnitude: 0.48570 au
magnitude: 1.23455 debye
