program: Orca
programVersion: 5.0.2
elementType: N C C C C C C C C C C C C C C C C C C C C C H H H H H H H H H H H H H H H H H H H H H
charge: 0
multiplicity: 1
keywords: wb97x-d3
keywords: def2-TZVPP
keywords: def2/J RIJCOSX
keywords: DEFGRID2
keywords: scfconv7
keywords: smallprint printgap noloewdin
keywords: NOSOSCF
formula: C21H21N
InChI: InChI=1/C21H21N/c1-22(16-8-11-18-9-3-2-4-10-18)17-20-14-7-13-19-12-5-6-15-21(19)20/h2-15H,16-17H2,1H3
43 atoms
N  -3.057823 -1.441095 0.196062
C  -2.737009 -0.020802 0.3157
C  -2.012335 0.541943 -0.882268
C  -0.801733 1.289756 -0.759982
C  -0.145592 1.739111 -1.94155
C  -1.888868 -2.271951 -0.091198
C  -2.534652 0.327079 -2.134508
C  -3.744216 -1.874828 1.398599
C  -0.199116 1.606974 0.485062
C  -0.71666 1.475306 -3.20626
C  -1.896514 0.793005 -3.297974
C  1.079399 2.442359 -1.839634
C  -0.69682 -2.029602 0.785798
C  0.97975 2.296993 0.552821
C  1.635773 2.714302 -0.622134
C  0.483492 -1.656047 0.289325
C  1.694567 -1.295822 1.029086
C  1.786153 -1.333438 2.424041
C  2.798131 -0.832943 0.308412
C  2.938232 -0.914723 3.069038
C  3.951963 -0.412298 0.953262
C  4.026487 -0.44963 2.338381
H  -2.174301 0.1755 1.234728
H  -3.682531 0.516507 0.436576
H  -1.595113 -2.128953 -1.133768
H  -2.213276 -3.313252 -0.008452
H  -3.459674 -0.225535 -2.236423
H  -4.026918 -2.924053 1.309886
H  -4.660895 -1.297728 1.530209
H  -3.155183 -1.761652 2.319246
H  -0.667234 1.29819 1.408527
H  -0.208037 1.826381 -4.095977
H  -2.343317 0.598856 -4.264338
H  1.569131 2.762949 -2.751361
H  -0.838914 -2.128907 1.858545
H  1.417607 2.516627 1.517947
H  2.574046 3.2492 -0.555755
H  0.569575 -1.557077 -0.790223
H  0.950282 -1.684955 3.015895
H  2.742362 -0.789502 -0.773009
H  2.987534 -0.946767 4.149819
H  4.790774 -0.050377 0.372809
H  4.922237 -0.117711 2.846769
elementType: N C H
totalener: -867.66742418 hartree
nucrepener: 1727.41117679 hartree
electener: -2595.07860097 hartree
oneelecener: -4605.45757691 hartree
twoeener: 2010.37897594 hartree
cpcmener: -0.02164555 hartree
kineticenergy: 863.62932291 hartree
xcener: -88.226493815584 hartree
chargesum: 0.0000000
charge: -0.209978 -0.084714 0.156826 -0.092562 0.002335 -0.051903 -0.239762 -0.207052 -0.228749 -0.162491 -0.121752 -0.098888 -0.132369 -0.169379 -0.158937 -0.114366 0.071684 -0.215593 -0.210920 -0.154541 -0.154890 -0.163025 0.102605 0.116360 0.095732 0.106897 0.125185 0.101566 0.100290 0.080443 0.150741 0.143783 0.159209 0.142370 0.127887 0.156420 0.158663 0.107843 0.143595 0.140098 0.159858 0.159595 0.161886
qa: -0.2100 -0.0847 0.1568 -0.0926 0.0023 -0.0519 -0.2398 -0.2071 -0.2287 -0.1625 -0.1218 -0.0989 -0.1324 -0.1694 -0.1589 -0.1144 0.0717 -0.2156 -0.2109 -0.1545 -0.1549 -0.1630 0.1026 0.1164 0.0957 0.1069 0.1252 0.1016 0.1003 0.0804 0.1507 0.1438 0.1592 0.1424 0.1279 0.1564 0.1587 0.1078 0.1436 0.1401 0.1599 0.1596 0.1619
va: 2.8592 3.8483 3.4214 3.6933 3.8030 3.9467 3.9313 3.9554 3.8508 3.9393 3.8849 3.8498 3.7290 3.8690 3.8705 3.8472 3.5770 3.9422 3.8973 3.8955 3.8783 3.8848 1.0009 0.9946 0.9985 0.9981 1.0336 0.9975 0.9946 0.9957 1.0077 1.0048 0.9893 1.0050 1.0021 0.9935 0.9898 1.0160 1.0106 1.0108 0.9907 0.9905 0.9885
dispcorr: -0.023696722 hartree
energy: -867.691120899668
dipole: -6.02514 6.09026 0.06512 -5.58092 5.54877 -0.03214 5.17870 -4.67501 0.50369
magnitude: 0.50890 au
magnitude: 1.29351 debye
