program: Orca
programVersion: 5.0.2
elementType: N C C C C C C C C C C C C C C C C C C C C C H H H H H H H H H H H H H H H H H H H H H
charge: 0
multiplicity: 1
keywords: wb97x-d3
keywords: def2-TZVPP
keywords: def2/J RIJCOSX
keywords: DEFGRID2
keywords: scfconv7
keywords: smallprint printgap noloewdin
keywords: NOSOSCF
formula: C21H21N
InChI: InChI=1/C21H21N/c1-22(16-8-11-18-9-3-2-4-10-18)17-20-14-7-13-19-12-5-6-15-21(19)20/h2-15H,16-17H2,1H3
43 atoms
N  -2.238675 -0.672622 0.843243
C  -1.976764 -0.520668 -0.583447
C  -1.199932 0.72049 -0.934959
C  -1.75018 2.025642 -0.768208
C  -0.952964 3.160615 -1.082996
C  -1.03581 -0.635436 1.664158
C  0.071886 0.597097 -1.435201
C  -3.025956 -1.867707 1.073293
C  -3.075846 2.245197 -0.320311
C  0.361311 2.978684 -1.573187
C  0.858559 1.720437 -1.756306
C  -1.489823 4.458532 -0.912142
C  0.016956 -1.662564 1.364671
C  -3.572079 3.512717 -0.175716
C  -2.769911 4.634167 -0.465295
C  1.288937 -1.336995 1.129348
C  2.402208 -2.249423 0.855546
C  3.571344 -1.729094 0.294783
C  2.354144 -3.618985 1.132835
C  4.65287 -2.547575 0.004626
C  3.435452 -4.436602 0.845978
C  4.589311 -3.906491 0.27975
H  -2.945533 -0.509506 -1.092366
H  -1.434997 -1.387542 -0.99166
H  -1.35931 -0.752227 2.70352
H  -0.592154 0.361339 1.599233
H  0.4892 -0.392076 -1.57704
H  -3.220529 -1.985543 2.139961
H  -2.557902 -2.794277 0.713726
H  -3.990992 -1.777632 0.571926
H  -3.709505 1.400397 -0.093368
H  0.959755 3.850777 -1.80709
H  1.859311 1.576801 -2.142076
H  -0.867488 5.31339 -1.148381
H  -0.291285 -2.70457 1.359595
H  -4.589259 3.657447 0.164504
H  -3.17169 5.630688 -0.336967
H  1.549202 -0.28143 1.109472
H  3.627495 -0.668293 0.079619
H  1.472264 -4.049294 1.591012
H  5.546393 -2.122575 -0.433917
H  3.38254 -5.493272 1.074528
H  5.433411 -4.547641 0.062418
elementType: N C H
totalener: -867.67050350 hartree
nucrepener: 1637.04498937 hartree
electener: -2504.71549287 hartree
oneelecener: -4424.40229269 hartree
twoeener: 1919.68679982 hartree
cpcmener: -0.02103864 hartree
kineticenergy: 863.62665317 hartree
xcener: -88.221980596717 hartree
chargesum: -0.0000000
charge: -0.224833 -0.055040 0.162614 -0.119737 -0.029392 -0.056074 -0.188772 -0.205835 -0.253444 -0.157051 -0.137680 -0.095722 -0.117044 -0.157765 -0.160728 -0.146524 0.075518 -0.186604 -0.214305 -0.169918 -0.160720 -0.160644 0.119875 0.106953 0.105263 0.096286 0.134045 0.102307 0.080200 0.101262 0.142117 0.144477 0.157389 0.144370 0.126641 0.158334 0.159759 0.116643 0.142309 0.142217 0.158324 0.159426 0.161505
qa: -0.2248 -0.0550 0.1626 -0.1197 -0.0294 -0.0561 -0.1888 -0.2058 -0.2534 -0.1571 -0.1377 -0.0957 -0.1170 -0.1578 -0.1607 -0.1465 0.0755 -0.1866 -0.2143 -0.1699 -0.1607 -0.1606 0.1199 0.1070 0.1053 0.0963 0.1340 0.1023 0.0802 0.1013 0.1421 0.1445 0.1574 0.1444 0.1266 0.1583 0.1598 0.1166 0.1423 0.1422 0.1583 0.1594 0.1615
va: 2.7961 3.7204 3.3936 3.8457 3.8443 3.9716 3.8961 3.9505 3.9826 3.9410 3.8979 3.8620 3.7302 3.9280 3.9039 3.8660 3.6009 3.9364 3.9623 3.9097 3.9000 3.8862 0.9889 1.0036 0.9947 1.0018 1.0057 0.9964 0.9955 0.9949 1.0277 1.0041 0.9915 1.0046 1.0059 0.9924 0.9894 1.0125 1.0088 1.0096 0.9916 0.9914 0.9892
dispcorr: -0.020012571 hartree
energy: -867.690516074739
dipole: -3.96359 4.04672 0.08313 -7.29775 6.83274 -0.46501 3.39936 -3.43548 -0.03612
magnitude: 0.47376 au
magnitude: 1.20419 debye
