program: Orca
programVersion: 5.0.2
elementType: N C C C C C C C C C C C C C C C C C C C C C H H H H H H H H H H H H H H H H H H H H H
charge: 0
multiplicity: 1
keywords: wb97x-d3
keywords: def2-TZVPP
keywords: def2/J RIJCOSX
keywords: DEFGRID2
keywords: scfconv7
keywords: smallprint printgap noloewdin
keywords: NOSOSCF
formula: C21H21N
InChI: InChI=1/C21H21N/c1-22(16-8-11-18-9-3-2-4-10-18)17-20-14-7-13-19-12-5-6-15-21(19)20/h2-15H,16-17H2,1H3
43 atoms
N  -3.255662 -1.380747 0.02461
C  -3.221795 0.021769 -0.375644
C  -2.052264 0.855725 0.107378
C  -0.945028 1.186526 -0.731713
C  0.156736 1.897706 -0.178328
C  -2.123957 -2.182757 -0.417218
C  -2.042553 1.289115 1.412042
C  -3.57684 -1.595934 1.419149
C  -0.872296 0.824309 -2.099413
C  0.132073 2.28398 1.180976
C  -0.953159 1.994911 1.95758
C  1.274089 2.204709 -0.990931
C  -0.806556 -1.890658 0.241438
C  0.217713 1.141573 -2.864191
C  1.307969 1.837657 -2.306673
C  0.347066 -1.792221 -0.418559
C  1.645484 -1.414646 0.145838
C  1.837958 -1.13548 1.503732
C  2.73629 -1.265491 -0.714107
C  3.070388 -0.716551 1.975224
C  3.972578 -0.846199 -0.242627
C  4.145498 -0.566714 1.105197
H  -4.142292 0.476738 -0.002856
H  -3.298358 0.06007 -1.462118
H  -2.022577 -2.08377 -1.501552
H  -2.388399 -3.229895 -0.231587
H  -2.896285 1.084285 2.046354
H  -2.811546 -1.28165 2.139086
H  -3.757045 -2.659568 1.586347
H  -4.495464 -1.064699 1.671868
H  -1.684117 0.27936 -2.560005
H  0.980552 2.818845 1.590468
H  -0.983406 2.304879 2.994028
H  2.106724 2.738422 -0.548389
H  -0.828392 -1.745069 1.317288
H  0.243463 0.852603 -3.906879
H  2.165807 2.078294 -2.920778
H  0.341794 -1.937418 -1.495886
H  1.017152 -1.234211 2.202911
H  2.608143 -1.470364 -1.770623
H  3.193666 -0.501507 3.028988
H  4.80014 -0.73474 -0.931308
H  5.105846 -0.23431 1.477106
elementType: N C H
totalener: -867.66631916 hartree
nucrepener: 1768.62479258 hartree
electener: -2636.29111174 hartree
oneelecener: -4688.09976979 hartree
twoeener: 2051.80865806 hartree
cpcmener: -0.02333292 hartree
kineticenergy: 863.63884409 hartree
xcener: -88.232152566485 hartree
chargesum: 0.0000000
charge: -0.207007 -0.124391 0.128054 0.023779 -0.026097 -0.052080 -0.189512 -0.220639 -0.257870 -0.212234 -0.122264 -0.122133 -0.104423 -0.136814 -0.163345 -0.152261 0.126555 -0.264333 -0.216749 -0.140532 -0.152391 -0.170209 0.115214 0.114391 0.099308 0.105799 0.151421 0.079636 0.106746 0.104441 0.137531 0.138938 0.158146 0.138360 0.119687 0.157442 0.158724 0.108706 0.142390 0.140659 0.159600 0.158989 0.160766
qa: -0.2070 -0.1244 0.1281 0.0238 -0.0261 -0.0521 -0.1895 -0.2206 -0.2579 -0.2122 -0.1223 -0.1221 -0.1044 -0.1368 -0.1633 -0.1523 0.1266 -0.2643 -0.2167 -0.1405 -0.1524 -0.1702 0.1152 0.1144 0.0993 0.1058 0.1514 0.0796 0.1067 0.1044 0.1375 0.1389 0.1581 0.1384 0.1197 0.1574 0.1587 0.1087 0.1424 0.1407 0.1596 0.1590 0.1608
va: 2.8796 3.9333 3.2819 3.6200 3.7383 3.9395 3.8955 3.9624 3.9016 3.9120 3.8825 3.8086 3.7051 3.8734 3.8712 3.8616 3.4834 3.9247 3.9173 3.8774 3.8800 3.8937 0.9979 1.0000 1.0005 0.9952 0.9925 0.9848 0.9986 0.9930 1.0147 1.0074 0.9892 1.0070 1.0030 0.9903 0.9894 1.0210 1.0120 1.0105 0.9899 0.9899 0.9887
dispcorr: -0.025788670 hartree
energy: -867.692107826537
dipole: -6.25221 6.18790 -0.06432 -5.20246 5.28143 0.07897 2.58202 -2.36741 0.21461
magnitude: 0.23755 au
magnitude: 0.60381 debye
