program: Orca
programVersion: 5.0.2
elementType: N C C C C C C C C C C C C C C C C C C C C C H H H H H H H H H H H H H H H H H H H H H
charge: 0
multiplicity: 1
keywords: wb97x-d3
keywords: def2-TZVPP
keywords: def2/J RIJCOSX
keywords: DEFGRID2
keywords: scfconv7
keywords: smallprint printgap noloewdin
keywords: NOSOSCF
formula: C21H21N
InChI: InChI=1/C21H21N/c1-22(16-8-11-18-9-3-2-4-10-18)17-20-14-7-13-19-12-5-6-15-21(19)20/h2-15H,16-17H2,1H3
43 atoms
N  -1.053785 -1.14387 -0.876443
C  -1.619476 -0.195704 0.076606
C  -2.429008 0.885624 -0.596575
C  -1.943279 2.211945 -0.79394
C  -2.782152 3.16701 -1.437043
C  -0.60379 -2.367968 -0.222916
C  -3.690587 0.568578 -1.038866
C  -0.004484 -0.549924 -1.680756
C  -0.654293 2.637089 -0.381055
C  -4.070641 2.787425 -1.873886
C  -4.515286 1.510063 -1.679403
C  -2.314957 4.488809 -1.63316
C  0.561754 -2.236037 0.713385
C  -0.23035 3.921607 -0.586099
C  -1.068649 4.862591 -1.216995
C  1.727993 -2.848164 0.498903
C  2.919406 -2.825587 1.353104
C  4.047819 -3.539788 0.942093
C  2.984299 -2.133613 2.567183
C  5.201018 -3.568829 1.712943
C  4.135388 -2.161199 3.336983
C  5.249462 -2.880086 2.916291
H  -0.85772 0.242209 0.733586
H  -2.290511 -0.754602 0.732578
H  -0.35395 -3.094123 -1.0010
H  -1.456587 -2.780025 0.325165
H  -4.068036 -0.434584 -0.880987
H  0.407125 -1.299647 -2.35782
H  0.829198 -0.136193 -1.097921
H  -0.407801 0.252969 -2.298506
H  0.013213 1.939772 0.105651
H  -4.698016 3.524157 -2.360893
H  -5.503344 1.217549 -2.00991
H  -2.968297 5.202062 -2.121176
H  0.41563 -1.62161 1.597436
H  0.757883 4.218741 -0.260302
H  -0.721846 5.87601 -1.370523
H  1.82783 -3.449588 -0.402003
H  4.017216 -4.081786 0.004171
H  2.129964 -1.570003 2.920505
H  6.060767 -4.131308 1.3724
H  4.164373 -1.620662 4.274296
H  6.145444 -2.901098 3.522657
elementType: N C H
totalener: -867.67093311 hartree
nucrepener: 1578.63640948 hartree
electener: -2446.30734259 hartree
oneelecener: -4307.37406813 hartree
twoeener: 1861.06672554 hartree
cpcmener: -0.02340209 hartree
kineticenergy: 863.62143989 hartree
xcener: -88.219056551347 hartree
chargesum: -0.0000000
charge: -0.208962 -0.054928 0.125759 -0.084164 -0.021013 -0.055307 -0.231242 -0.237912 -0.218267 -0.144529 -0.151448 -0.106553 -0.155577 -0.164749 -0.154054 -0.096853 0.054875 -0.170372 -0.221742 -0.171366 -0.159736 -0.161785 0.106000 0.110100 0.098384 0.100357 0.135762 0.113438 0.084323 0.114533 0.151719 0.144490 0.157715 0.143322 0.128677 0.157762 0.160391 0.113953 0.142416 0.145433 0.159532 0.159915 0.161702
qa: -0.2090 -0.0549 0.1258 -0.0842 -0.0210 -0.0553 -0.2312 -0.2379 -0.2183 -0.1445 -0.1514 -0.1066 -0.1556 -0.1647 -0.1541 -0.0969 0.0549 -0.1704 -0.2217 -0.1714 -0.1597 -0.1618 0.1060 0.1101 0.0984 0.1004 0.1358 0.1134 0.0843 0.1145 0.1517 0.1445 0.1577 0.1433 0.1287 0.1578 0.1604 0.1140 0.1424 0.1454 0.1595 0.1599 0.1617
va: 2.8208 3.8192 3.4147 3.7838 3.8426 3.9576 3.9987 3.9595 3.9308 3.9175 3.9055 3.8720 3.7098 3.9411 3.9005 3.8113 3.6840 3.9277 3.9563 3.9003 3.8995 3.8867 1.0000 0.9968 1.0040 0.9994 1.0097 0.9979 0.9910 0.9902 0.9952 1.0047 0.9907 1.0056 1.0084 0.9923 0.9890 1.0213 1.0081 1.0117 0.9911 0.9911 0.9890
dispcorr: -0.018254208 hartree
energy: -867.689187316376
dipole: 3.25669 -2.98120 0.27548 -5.03008 5.04464 0.01456 -0.46514 0.80240 0.33726
magnitude: 0.43571 au
magnitude: 1.10750 debye
