program: Orca
programVersion: 5.0.2
elementType: N C C C C C C C C C C C C C C C C C C C C C H H H H H H H H H H H H H H H H H H H H H
charge: 0
multiplicity: 1
keywords: wb97x-d3
keywords: def2-TZVPP
keywords: def2/J RIJCOSX
keywords: DEFGRID2
keywords: scfconv7
keywords: smallprint printgap noloewdin
keywords: NOSOSCF
formula: C21H21N
InChI: InChI=1/C21H21N/c1-22(16-8-11-18-9-3-2-4-10-18)17-20-14-7-13-19-12-5-6-15-21(19)20/h2-15H,16-17H2,1H3
43 atoms
N  -1.752304 -1.241151 -0.056549
C  -0.929163 -0.427093 -0.944406
C  -1.68951 0.726955 -1.55002
C  -1.520618 2.076483 -1.119105
C  -2.275367 3.105214 -1.753101
C  -1.071511 -2.486467 0.286873
C  -2.578482 0.461279 -2.563573
C  -2.172044 -0.508189 1.122629
C  -0.627491 2.456484 -0.084516
C  -3.182323 2.775249 -2.784615
C  -3.329124 1.476446 -3.182579
C  -2.107055 4.450267 -1.345012
C  0.19285 -2.35203 1.084286
C  -0.485943 3.765778 0.28704
C  -1.229715 4.778533 -0.350533
C  1.3911 -2.715898 0.624025
C  2.669781 -2.647846 1.339075
C  3.801907 -3.206213 0.741173
C  2.814712 -2.053105 2.597151
C  5.035256 -3.18389 1.376371
C  4.045397 -2.029875 3.231814
C  5.162154 -2.59601 2.626611
H  -0.592997 -1.072264 -1.75953
H  -0.014631 -0.074799 -0.452195
H  -0.857939 -3.024426 -0.640313
H  -1.780286 -3.101494 0.849763
H  -2.699834 -0.55924 -2.906494
H  -1.346579 -0.092254 1.71465
H  -2.748681 -1.165707 1.774366
H  -2.824141 0.319846 0.843763
H  -0.041526 1.705244 0.426087
H  -3.751711 3.56706 -3.256153
H  -4.017617 1.221936 -3.977775
H  -2.688527 5.218542 -1.840521
H  0.094545 -1.948414 2.087886
H  0.205593 4.027007 1.077307
H  -1.104426 5.810394 -0.049638
H  1.450408 -3.126497 -0.381409
H  3.711036 -3.667517 -0.235213
H  1.962324 -1.60061 3.088274
H  5.896976 -3.625787 0.893073
H  4.13555 -1.565359 4.205356
H  6.12167 -2.575219 3.126535
elementType: N C H
totalener: -867.67095252 hartree
nucrepener: 1592.08159756 hartree
electener: -2459.75255009 hartree
oneelecener: -4334.30095852 hartree
twoeener: 1874.54840843 hartree
cpcmener: -0.02289686 hartree
kineticenergy: 863.61963404 hartree
xcener: -88.219147465704 hartree
chargesum: 0.0000000
charge: -0.206575 -0.049752 0.096959 -0.070186 -0.017310 -0.056278 -0.225221 -0.237341 -0.212384 -0.139190 -0.152546 -0.108381 -0.164683 -0.168234 -0.153747 -0.079388 0.051641 -0.176030 -0.221091 -0.168164 -0.157636 -0.161523 0.108684 0.103509 0.097657 0.104204 0.135257 0.084041 0.113865 0.109685 0.150562 0.144634 0.157967 0.142878 0.124124 0.158018 0.160188 0.115639 0.142393 0.144408 0.158005 0.159827 0.161518
qa: -0.2066 -0.0498 0.0970 -0.0702 -0.0173 -0.0563 -0.2252 -0.2373 -0.2124 -0.1392 -0.1525 -0.1084 -0.1647 -0.1682 -0.1537 -0.0794 0.0516 -0.1760 -0.2211 -0.1682 -0.1576 -0.1615 0.1087 0.1035 0.0977 0.1042 0.1353 0.0840 0.1139 0.1097 0.1506 0.1446 0.1580 0.1429 0.1241 0.1580 0.1602 0.1156 0.1424 0.1444 0.1580 0.1598 0.1615
va: 2.8282 3.8169 3.4317 3.7703 3.8450 3.9587 3.9898 3.9667 3.9241 3.9152 3.9073 3.8741 3.7035 3.9416 3.8975 3.7890 3.6712 3.9331 3.9552 3.8995 3.8995 3.8869 0.9981 0.9980 1.0051 0.9977 1.0104 0.9905 0.9973 0.9889 0.9967 1.0046 0.9906 1.0058 1.0037 0.9920 0.9889 1.0196 1.0082 1.0111 0.9917 0.9912 0.9890
dispcorr: -0.018438446 hartree
energy: -867.689390970676
dipole: -0.67781 0.99903 0.32122 -4.98334 4.98110 -0.00224 4.33792 -4.04100 0.29692
magnitude: 0.43743 au
magnitude: 1.11186 debye
