program: Orca
programVersion: 5.0.2
elementType: N C C C C C C C C C C C C C C C C C C C C C H H H H H H H H H H H H H H H H H H H H H
charge: 0
multiplicity: 1
keywords: wb97x-d3
keywords: def2-TZVPP
keywords: def2/J RIJCOSX
keywords: DEFGRID2
keywords: scfconv7
keywords: smallprint printgap noloewdin
keywords: NOSOSCF
formula: C21H21N
InChI: InChI=1/C21H21N/c1-22(16-8-11-18-9-3-2-4-10-18)17-20-14-7-13-19-12-5-6-15-21(19)20/h2-15H,16-17H2,1H3
43 atoms
N  -3.126511 -1.565564 -0.038768
C  -3.005017 -0.147768 -0.368856
C  -1.688895 0.241182 -1.002196
C  -0.841497 1.256892 -0.466803
C  0.382167 1.558864 -1.131498
C  -2.269293 -1.941246 1.081179
C  -1.306902 -0.396832 -2.157138
C  -4.509485 -1.846891 0.302027
C  -1.134312 1.972626 0.721521
C  0.734536 0.861142 -2.308245
C  -0.098747 -0.096698 -2.811927
C  1.245103 2.546764 -0.600159
C  -0.818105 -1.911648 0.736384
C  -0.281504 2.925629 1.210114
C  0.923269 3.221212 0.543836
C  0.092996 -1.23625 1.436126
C  1.505796 -1.075458 1.086798
C  2.250234 -0.095757 1.747817
C  2.131656 -1.804324 0.069429
C  3.56604 0.166595 1.393669
C  3.444574 -1.543924 -0.283809
C  4.168036 -0.552692 0.371741
H  -3.223072 0.469819 0.511428
H  -3.796071 0.083265 -1.086742
H  -2.542328 -2.963166 1.363394
H  -2.455335 -1.312699 1.967525
H  -1.947335 -1.16027 -2.579489
H  -4.631419 -2.905889 0.531142
H  -5.159958 -1.613999 -0.541569
H  -4.869975 -1.27393 1.169141
H  -2.047319 1.774262 1.264289
H  1.670164 1.098771 -2.800066
H  0.164963 -0.631744 -3.715032
H  2.171801 2.75914 -1.119884
H  -0.531163 -2.468934 -0.149527
H  -0.534813 3.454846 2.119407
H  1.58977 3.975083 0.941779
H  -0.238965 -0.6649 2.299151
H  1.782413 0.480618 2.537381
H  1.590273 -2.578739 -0.459106
H  4.118956 0.937811 1.91414
H  3.908066 -2.11691 -1.076612
H  5.193032 -0.350132 0.090276
elementType: N C H
totalener: -867.66838860 hartree
nucrepener: 1762.79766960 hartree
electener: -2630.46605819 hartree
oneelecener: -4676.76355805 hartree
twoeener: 2046.29749985 hartree
cpcmener: -0.02309138 hartree
kineticenergy: 863.64048960 hartree
xcener: -88.227068575588 hartree
chargesum: 0.0000000
charge: -0.217653 -0.098299 0.246808 -0.088272 0.052097 -0.059789 -0.260641 -0.206623 -0.255291 -0.220193 -0.113093 -0.141873 -0.095054 -0.149049 -0.145371 -0.121028 0.107423 -0.209328 -0.261811 -0.170143 -0.144880 -0.155985 0.112659 0.118642 0.103795 0.085821 0.123880 0.100795 0.100116 0.079957 0.145345 0.139454 0.157225 0.138687 0.109959 0.157406 0.158892 0.113200 0.141552 0.141748 0.158046 0.159634 0.161236
qa: -0.2177 -0.0983 0.2468 -0.0883 0.0521 -0.0598 -0.2606 -0.2066 -0.2553 -0.2202 -0.1131 -0.1419 -0.0951 -0.1490 -0.1454 -0.1210 0.1074 -0.2093 -0.2618 -0.1701 -0.1449 -0.1560 0.1127 0.1186 0.1038 0.0858 0.1239 0.1008 0.1001 0.0800 0.1453 0.1395 0.1572 0.1387 0.1100 0.1574 0.1589 0.1132 0.1416 0.1417 0.1580 0.1596 0.1612
va: 2.8410 3.8476 3.2907 3.7247 3.6520 3.9603 3.9607 3.9537 3.8951 3.9047 3.8513 3.8243 3.7908 3.8855 3.8654 3.8583 3.5225 3.8903 3.9330 3.8814 3.8696 3.8762 1.0077 0.9952 0.9917 1.0120 1.0308 0.9961 0.9968 0.9984 1.0154 1.0081 0.9891 1.0078 1.0235 0.9908 0.9886 1.0205 1.0099 1.0118 0.9919 0.9900 0.9880
dispcorr: -0.025198650 hartree
energy: -867.693587246909
dipole: -9.21941 8.71561 -0.50380 -4.58766 4.74385 0.15620 3.15565 -2.84075 0.31490
magnitude: 0.61431 au
magnitude: 1.56145 debye
