program: Orca
programVersion: 5.0.2
elementType: N C C C C C C C C C C C C C C C C C C C C C H H H H H H H H H H H H H H H H H H H H H
charge: 0
multiplicity: 1
keywords: wb97x-d3
keywords: def2-TZVPP
keywords: def2/J RIJCOSX
keywords: DEFGRID2
keywords: scfconv7
keywords: smallprint printgap noloewdin
keywords: NOSOSCF
formula: C21H21N
InChI: InChI=1/C21H21N/c1-22(16-8-11-18-9-3-2-4-10-18)17-20-14-7-13-19-12-5-6-15-21(19)20/h2-15H,16-17H2,1H3
43 atoms
N  -1.568395 -0.925664 0.271285
C  -0.765238 0.292704 0.255559
C  -1.033481 1.155896 -0.951353
C  -1.782964 2.367703 -0.894802
C  -1.963304 3.124729 -2.088156
C  -1.07743 -1.842576 1.292698
C  -0.515982 0.751276 -2.158309
C  -2.965491 -0.625191 0.511929
C  -2.364747 2.86769 0.298609
C  -1.413691 2.66106 -3.303525
C  -0.704221 1.493601 -3.336841
C  -2.692882 4.336978 -2.043951
C  0.298507 -2.343316 0.997911
C  -3.065004 4.043077 0.309314
C  -3.230724 4.791379 -0.873243
C  1.298564 -2.315661 1.880236
C  2.667856 -2.798438 1.676251
C  3.559953 -2.756871 2.75055
C  3.136274 -3.282371 0.449816
C  4.873483 -3.181868 2.610653
C  4.447896 -3.703549 0.308408
C  5.324467 -3.655391 1.387101
H  0.285861 0.000476 0.21924
H  -0.879775 0.857921 1.191106
H  -1.76218 -2.696416 1.315482
H  -1.104811 -1.395917 2.30016
H  0.06675 -0.161055 -2.204564
H  -3.143931 -0.129481 1.477199
H  -3.549884 -1.545533 0.499182
H  -3.362404 0.019997 -0.271387
H  -2.25786 2.317391 1.223038
H  -1.559074 3.246605 -4.203147
H  -0.276404 1.138729 -4.265108
H  -2.817006 4.900819 -2.960727
H  0.447901 -2.762734 0.007166
H  -3.496662 4.40199 1.23458
H  -3.784175 5.720889 -0.849963
H  1.10565 -1.888387 2.861004
H  3.216935 -2.384814 3.708884
H  2.477509 -3.325072 -0.40836
H  5.544766 -3.139764 3.458605
H  4.791167 -4.068167 -0.6512
H  6.349666 -3.981763 1.271245
elementType: N C H
totalener: -867.67235293 hartree
nucrepener: 1579.33173641 hartree
electener: -2447.00408934 hartree
oneelecener: -4308.84702616 hartree
twoeener: 1861.84293683 hartree
cpcmener: -0.02238124 hartree
kineticenergy: 863.62448908 hartree
xcener: -88.218185427820 hartree
chargesum: -0.0000000
charge: -0.207367 -0.082000 0.155101 -0.090412 -0.023719 -0.056489 -0.221166 -0.229640 -0.228184 -0.141495 -0.160748 -0.099180 -0.132040 -0.162350 -0.157056 -0.094006 0.050844 -0.176016 -0.215896 -0.169276 -0.164208 -0.159838 0.118332 0.113000 0.103517 0.085426 0.140274 0.083813 0.109904 0.107822 0.147893 0.144028 0.157276 0.142617 0.111787 0.157789 0.159962 0.114811 0.141788 0.145287 0.159220 0.158890 0.161703
qa: -0.2074 -0.0820 0.1551 -0.0904 -0.0237 -0.0565 -0.2212 -0.2296 -0.2282 -0.1415 -0.1607 -0.0992 -0.1320 -0.1623 -0.1571 -0.0940 0.0508 -0.1760 -0.2159 -0.1693 -0.1642 -0.1598 0.1183 0.1130 0.1035 0.0854 0.1403 0.0838 0.1099 0.1078 0.1479 0.1440 0.1573 0.1426 0.1118 0.1578 0.1600 0.1148 0.1418 0.1453 0.1592 0.1589 0.1617
va: 2.8356 3.8131 3.3524 3.7923 3.8485 3.9573 3.9793 3.9645 3.9350 3.9164 3.9174 3.8657 3.8316 3.9366 3.9033 3.8577 3.6739 3.9328 3.9505 3.8994 3.9061 3.8846 0.9956 1.0091 0.9929 1.0090 1.0061 0.9988 0.9999 0.9896 1.0049 1.0048 0.9914 1.0057 1.0286 0.9921 0.9892 1.0215 1.0086 1.0094 0.9912 0.9917 0.9890
dispcorr: -0.017978800 hartree
energy: -867.690331729029
dipole: -3.39810 3.27759 -0.12051 -4.48934 4.60018 0.11084 4.80353 -4.35802 0.44552
magnitude: 0.47465 au
magnitude: 1.20646 debye
