program: Orca
programVersion: 5.0.2
elementType: N C C C C C C C C C C C C C C C C C C C C C H H H H H H H H H H H H H H H H H H H H H
charge: 0
multiplicity: 1
keywords: wb97x-d3
keywords: def2-TZVPP
keywords: def2/J RIJCOSX
keywords: DEFGRID2
keywords: scfconv7
keywords: smallprint printgap noloewdin
keywords: NOSOSCF
formula: C21H21N
InChI: InChI=1/C21H21N/c1-22(16-8-11-18-9-3-2-4-10-18)17-20-14-7-13-19-12-5-6-15-21(19)20/h2-15H,16-17H2,1H3
43 atoms
N  -1.9333 -1.447445 -0.268514
C  -2.150414 -0.218162 0.486097
C  -2.234564 1.003274 -0.387919
C  -1.07246 1.547024 -1.011659
C  -1.201626 2.694854 -1.84052
C  -1.590197 -2.545885 0.631163
C  -3.444955 1.616149 -0.589589
C  -3.115183 -1.795735 -1.031721
C  0.220962 1.000139 -0.82499
C  -2.474354 3.285512 -2.022426
C  -3.572051 2.759276 -1.403883
C  -0.052041 3.237833 -2.46179
C  -0.311773 -2.307566 1.385879
C  1.316473 1.553322 -1.430378
C  1.180998 2.680386 -2.265008
C  0.879611 -2.243335 0.788838
C  2.167423 -1.950936 1.42452
C  2.352821 -1.933878 2.810853
C  3.264887 -1.663569 0.609076
C  3.589989 -1.632718 3.355528
C  4.503991 -1.358286 1.154395
C  4.671704 -1.341101 2.531468
H  -1.327661 -0.098547 1.194908
H  -3.067208 -0.283186 1.093478
H  -1.494544 -3.448664 0.02257
H  -2.400654 -2.74456 1.349395
H  -4.32826 1.210198 -0.11062
H  -4.005806 -1.951262 -0.403773
H  -2.937751 -2.714748 -1.59188
H  -3.352235 -1.015864 -1.755136
H  0.351795 0.132783 -0.193079
H  -2.561568 4.162241 -2.65278
H  -4.545173 3.213571 -1.536613
H  -0.165556 4.109546 -3.095069
H  -0.395459 -2.153879 2.456693
H  2.294808 1.118183 -1.269164
H  2.054117 3.104001 -2.743737
H  0.927993 -2.386991 -0.287631
H  1.529626 -2.165935 3.474678
H  3.141709 -1.677373 -0.467717
H  3.713159 -1.628057 4.430865
H  5.33819 -1.135428 0.501925
H  5.636456 -1.106301 2.961687
elementType: N C H
totalener: -867.66945379 hartree
nucrepener: 1648.56673810 hartree
electener: -2516.23619189 hartree
oneelecener: -4447.65168885 hartree
twoeener: 1931.41549696 hartree
cpcmener: -0.02179008 hartree
kineticenergy: 863.62170465 hartree
xcener: -88.218172278122 hartree
chargesum: -0.0000000
charge: -0.222247 -0.041843 0.027018 -0.098455 -0.017335 -0.070053 -0.142651 -0.221345 -0.196809 -0.145650 -0.141694 -0.110216 -0.120772 -0.177220 -0.148422 -0.124344 0.085340 -0.223192 -0.214927 -0.154262 -0.156739 -0.165910 0.123194 0.105341 0.101994 0.097976 0.135065 0.080975 0.105273 0.106635 0.139403 0.144119 0.158016 0.143288 0.135551 0.154754 0.159162 0.122584 0.143863 0.143333 0.159707 0.159584 0.161908
qa: -0.2222 -0.0418 0.0270 -0.0985 -0.0173 -0.0701 -0.1427 -0.2213 -0.1968 -0.1456 -0.1417 -0.1102 -0.1208 -0.1772 -0.1484 -0.1243 0.0853 -0.2232 -0.2149 -0.1543 -0.1567 -0.1659 0.1232 0.1053 0.1020 0.0980 0.1351 0.0810 0.1053 0.1066 0.1394 0.1441 0.1580 0.1433 0.1356 0.1548 0.1592 0.1226 0.1439 0.1433 0.1597 0.1596 0.1619
va: 2.7895 3.7160 3.5014 3.9275 3.8195 3.9235 3.8914 3.9684 3.9467 3.9257 3.9040 3.8785 3.7801 3.9386 3.9020 3.8150 3.5820 3.9671 3.9322 3.8986 3.9005 3.8927 0.9902 1.0161 0.9972 1.0063 1.0096 1.0033 0.9981 0.9913 1.0144 1.0052 0.9904 1.0052 1.0015 0.9951 0.9902 1.0261 1.0111 1.0089 0.9914 0.9911 0.9891
dispcorr: -0.020077161 hartree
energy: -867.689530954201
dipole: -5.42782 5.01166 -0.41616 -7.06675 6.88027 -0.18648 1.53067 -1.18827 0.34240
magnitude: 0.57027 au
magnitude: 1.44950 debye
