program: Gaussian 09
title: 000063578
version: EM64L-G09RevD.01
frameworkgroup: C1[X(C27H18N4O)]
method: RPBEPBE
basis: SDD
operation: Freq
keyword: #p
keyword: freq=noraman
keyword: PBEPBE/SDD
title: #p freq=noraman PBEPBE/SDD
converged: YES YES NO NO
title: Mulliken charges:
elementType: O N N N N C C C C C C C C C C C C C C C C C C C C C C C C C C C H H H H H H H H H H H H H H H H H H
charge: -0.236675 -0.338356 -0.462685 -0.032521 -0.060732 0.289719 0.336604 0.046850 0.048152 0.113830 0.158665 0.078290 -0.335489 0.271592 0.307066 -0.398209 0.022895 -0.240689 -0.250131 -0.325985 -0.364500 -0.371582 -0.350547 -0.346646 -0.351268 -0.247991 -0.208658 -0.213822 -0.233434 -0.245760 -0.247789 -0.236528 0.269001 0.316243 0.227390 0.236679 0.232241 0.270951 0.260335 0.234458 0.251764 0.267994 0.255668 0.231579 0.230870 0.224907 0.227172 0.228641 0.230919 0.229525
chargesum: 0.00000
title: Mulliken charges with hydrogens summed into heavy atoms:
elementType: O N N N N C C C C C C C C C C C C C C C C C C C C C C C C C C C
charge: -0.236675 -0.338356 -0.146442 -0.032521 -0.060732 0.289719 0.336604 0.046850 0.048152 0.113830 0.158665 0.078290 -0.066488 0.271592 0.307066 -0.170819 0.022895 -0.004010 -0.017891 -0.055034 -0.104165 -0.137124 -0.098783 -0.078652 -0.095600 -0.016412 0.022212 0.011085 -0.006262 -0.017119 -0.016871 -0.007003
polarizability: 3.85228084e+02 -3.40208993e+01 3.99284516e+02 3.02983373e+01 4.02504084e+01 2.24713020e+02
1716.lowfreq: -4.9674 -0.0004 0.0005 0.0006 1.7895 4.0883 16.2921 27.6835 35.8208
frequency: 16.2778 27.6506 35.8103 41.9024 43.3431 62.7642 72.7638 84.1498 98.3650 121.4842 145.9953 175.0628 188.0593 204.5456 241.3001 255.6492 261.8681 276.0743 296.2831 320.2636 333.4159 338.6646 363.9515 403.6877 416.6603 428.5161 445.3375 476.7141 495.7243 509.0291 512.1353 540.2192 546.8066 563.3344 565.5526 576.2869 577.4914 587.9453 614.0796 615.1265 642.3594 654.5671 665.4145 677.5605 690.8134 696.9565 700.4877 701.7602 748.8636 755.2805 767.5476 768.0217 775.9950 782.3367 794.1818 795.7122 819.3024 851.8108 858.3017 863.0954 876.4851 884.8871 895.0505 917.2491 928.5270 932.4365 939.1205 951.4735 977.9286 979.0088 979.5099 988.8309 989.8656 998.5890 1000.9416 1004.9042 1013.2537 1026.0582 1038.5806 1042.1145 1066.0254 1084.7061 1101.5582 1109.9928 1113.0130 1133.7908 1160.4262 1165.7014 1172.6710 1177.6544 1191.1859 1212.2219 1217.2686 1225.3786 1241.6544 1254.6733 1257.8118 1275.8597 1289.6440 1303.2889 1319.7784 1322.6184 1333.3343 1377.2478 1379.8297 1393.0110 1413.1235 1420.4191 1432.6735 1441.9808 1449.8892 1459.4302 1472.1891 1478.4872 1484.4323 1531.3072 1537.3699 1564.6501 1580.0796 1586.2379 1592.1571 1609.3935 1609.8347 1615.6825 1623.0573 1632.4643 3125.5474 3126.2360 3131.4717 3132.6966 3138.4732 3143.7662 3144.0030 3148.3922 3152.4680 3159.0197 3159.6615 3163.5537 3163.9330 3171.7607 3172.4122 3172.8242 3175.4564 3598.1946
redmass: 6.0088 6.0671 4.6563 5.0128 4.8734 5.7265 4.8926 5.1185 5.4872 5.5738 5.4827 4.9916 5.3378 5.7616 6.0241 4.4821 5.9052 5.6667 7.3291 5.7178 5.2026 5.8801 6.0722 2.8334 4.3128 3.0681 4.0910 4.0305 4.5125 7.7780 4.5912 3.9212 6.7553 4.4213 5.3523 3.4449 4.1701 1.5461 6.4339 5.9204 5.8108 6.3487 6.4409 4.7606 5.4762 4.7202 1.7207 6.4812 3.1059 1.4311 2.5149 1.9486 2.0507 1.5193 3.9725 4.1930 5.1301 1.2512 1.4848 2.3728 2.5983 5.0085 1.5083 5.1014 5.6722 1.7210 1.3801 1.4125 1.3735 1.3089 1.3843 1.3506 6.0565 1.3233 1.3312 2.1120 3.3301 2.3632 2.6889 3.5331 2.3650 1.6259 2.0154 2.3639 2.0855 1.7052 1.1405 1.1218 1.0536 1.0671 1.1160 2.1652 2.7844 2.7362 2.0678 2.3907 2.5958 1.8807 2.3175 3.1177 1.3895 3.1325 2.4958 10.2790 8.2439 10.0784 3.0210 2.3726 2.2862 3.0164 2.6279 2.6976 3.1675 2.9862 2.4860 5.6421 8.5019 7.1186 6.9473 6.2366 6.8610 8.2252 6.3009 7.0901 8.3719 7.4822 1.0872 1.0850 1.0855 1.0861 1.0890 1.0894 1.0905 1.0900 1.0936 1.0958 1.0946 1.0952 1.0955 1.0998 1.0999 1.0993 1.0997 1.0811
irintensity: 0.4126 0.4052 2.6987 0.2788 0.0506 2.0896 0.7181 0.8497 1.1878 1.0723 0.1096 1.8576 0.0926 0.0544 0.8263 6.1535 0.0751 2.1926 0.4970 0.6221 5.0168 3.2622 1.0561 0.1747 2.8887 4.6881 0.7147 3.0282 7.4252 3.3447 0.4609 6.4689 10.1841 6.7418 6.3940 5.7197 9.2093 58.1329 0.5457 4.0585 20.7075 2.8157 4.5469 5.5018 3.9883 2.4962 73.2315 0.4657 0.5940 130.2977 1.8319 45.2109 50.5823 67.3708 3.6856 3.4742 3.3155 0.8034 0.1521 0.9482 6.3848 0.3644 1.0311 10.5810 3.2488 1.4088 3.0554 0.4150 2.8667 0.0509 1.0985 0.1499 0.9163 0.9902 0.0372 6.7599 13.8847 14.8394 7.1327 4.6601 13.8737 11.8849 8.0294 15.2997 19.1314 14.5106 0.6369 1.5672 0.1155 0.2028 4.5788 3.6823 1.5086 54.2508 19.7699 18.0332 20.6235 16.0618 12.0301 9.3566 2.7933 94.3524 58.8843 2.0090 0.1944 45.5903 3.6833 29.1194 7.2314 22.7613 7.0998 50.9809 50.3701 22.2139 27.1179 82.5273 178.3314 1.7521 2.4423 10.8617 4.8809 159.3362 20.0558 43.1178 75.4728 8.2865 7.2884 0.0225 0.1622 5.1491 8.6850 5.8948 10.6275 11.0804 29.0160 24.8269 24.3016 10.7508 16.1517 13.8121 21.9162 25.0523 11.9666 32.6895
temp: 298.150 k
press: 1.00000 atm
elementType: 8 7 7 7 7 6 6 6 6 6 6 6 6 6 6 6 6 6 6 6 6 6 6 6 6 6 6 6 6 6 6 6 1 1 1 1 1 1 1 1 1 1 1 1 1 1 1 1 1 1
symmnumber: 1
zpe: 997987.9 jmol-1
zpe.correction: 0.380114 hartree
zpe.thermalcorrener: 0.404205 hartree
zpe.thermalcorrenthalpy: 0.405149 hartree
zpe.thermalcorrgfe: 0.324694 hartree
zpe.sumelectzpe: -1331.807855 hartree
zpe.sumelectthermal: -1331.783763 hartree
zpe.sumelectthermalent: -1331.782819 hartree
zpe.sumelectthermalfe: -1331.863275 hartree
dipole: 4.9706 -0.6193 1.0851
dipole: 5.1252
quadrupole: -154.0593 -160.2138 -191.8826
quadrupole: -10.7220 -4.9526 2.4940
quadrupole: 14.6592 8.5048 -23.1640 -10.7220 -4.9526 2.4940
hfenergy: -1332.1879685 hartree
pointgroup: C01 [X(C27H18N4O1)]
dipole: -0.8862875 -1.6570778 0.7311069 debye
polarizability: 367.7049521|67.2697328|337.7147744|69.5049037|-52.1882957|303.805893 unknown
InChI: InChI=1S/C27H18N4O/c32-27-19-12-4-6-14-21(19)30-26(18-10-2-1-3-11-18)31(27)24-17-9-5-13-20(24)25-28-22-15-7-8-16-23(22)29-25/h1-17,28H
charge 0 multiplicity 1
50 atoms
O  -0.106531 2.026249 -2.991082
N  -0.792115 1.156103 -0.909251
N  0.22774 -2.937129 -0.06875
N  0.08401 2.01072 1.170328
N  1.206854 -0.897182 -0.375227
C  -1.463645 0.076608 -1.613956
C  -1.030392 -1.275013 -1.478185
C  -0.731896 1.205122 0.506712
C  0.124191 -1.657065 -0.649218
C  -0.010991 2.054994 -1.731042
C  0.881183 2.948688 -0.976105
C  0.924509 2.870283 0.450522
C  -2.531183 0.403915 -2.474871
C  1.442422 -2.997041 0.623506
C  -1.632087 0.331322 1.317257
C  -1.743338 -2.277893 -2.193105
C  2.044984 -1.707067 0.415701
C  -3.218705 -0.60281 -3.182394
C  -2.828141 -1.953044 -3.030173
C  1.722262 3.857473 -1.668653
C  1.82435 3.70923 1.165827
C  2.060418 -4.005014 1.391977
C  -3.009521 0.159239 1.021309
C  -1.090808 -0.285216 2.47584
C  3.306468 -1.415234 0.984782
C  2.605743 4.680692 -0.951157
C  2.656059 4.601785 0.47017
C  3.317599 -3.692338 1.952168
C  3.930951 -2.419075 1.751675
C  -3.826122 -0.624523 1.864853
C  -1.905186 -1.079075 3.309313
C  -3.276668 -1.253391 3.006343
H  -2.811199 1.454962 -2.587594
H  -0.501091 -3.648097 -0.070354
H  -1.409408 -3.320332 -2.135472
H  -4.044201 -0.335892 -3.850016
H  -3.34956 -2.744115 -3.579312
H  1.664728 3.886273 -2.761579
H  1.837732 3.637175 2.257522
H  1.600066 -4.985799 1.550785
H  -3.451539 0.652988 0.150866
H  -0.033364 -0.124395 2.706939
H  3.768041 -0.436041 0.826451
H  3.257191 5.382792 -1.482206
H  3.347003 5.24651 1.024828
H  3.836869 -4.445285 2.555296
H  4.908176 -2.222731 2.205786
H  -4.891046 -0.737976 1.634006
H  -1.47312 -1.555322 4.196316
H  -3.912092 -1.864123 3.657725
