program: Orca
programVersion: 5.0.2
elementType: N C C C C C C C C C C C C C C C C C C C C C H H H H H H H H H H H H H H H H H H H H H
charge: 0
multiplicity: 1
keywords: wb97x-d3
keywords: def2-TZVPP
keywords: def2/J RIJCOSX
keywords: DEFGRID2
keywords: scfconv7
keywords: smallprint printgap noloewdin
keywords: NOSOSCF
formula: C21H21N
InChI: InChI=1/C21H21N/c1-22(16-8-11-18-9-3-2-4-10-18)17-20-14-7-13-19-12-5-6-15-21(19)20/h2-15H,16-17H2,1H3
43 atoms
N  -2.872845 -1.301068 -0.241437
C  -3.058578 0.089667 0.161874
C  -1.798742 0.854011 0.473446
C  -0.850891 1.185199 -0.538792
C  0.324921 1.900886 -0.185145
C  -2.280958 -2.110038 0.821417
C  -1.564979 1.268077 1.759813
C  -4.165612 -1.849132 -0.608722
C  -1.023983 0.815274 -1.893174
C  0.523022 2.299469 1.1585
C  -0.407029 1.993577 2.10916
C  1.284358 2.20069 -1.180015
C  -0.832359 -1.800736 1.079223
C  -0.084571 1.130358 -2.83877
C  1.087018 1.824656 -2.480472
C  0.118812 -1.909644 0.151449
C  1.509798 -1.470094 0.284256
C  2.059576 -1.019982 1.49012
C  2.31001 -1.424079 -0.859868
C  3.351647 -0.527043 1.540256
C  3.60769 -0.933712 -0.809894
C  4.133357 -0.47817 0.390023
H  -3.71813 0.152941 1.042671
H  -3.591528 0.594242 -0.649107
H  -2.378738 -3.156961 0.521719
H  -2.847462 -2.009443 1.760191
H  -2.282492 1.021292 2.533427
H  -4.891315 -1.85101 0.218647
H  -4.054234 -2.877162 -0.954947
H  -4.598383 -1.270862 -1.426112
H  -1.912564 0.277981 -2.190659
H  1.421758 2.846318 1.417422
H  -0.259237 2.297861 3.137071
H  2.180478 2.738548 -0.894276
H  -0.585046 -1.434865 2.069045
H  -0.240548 0.839469 -3.869634
H  1.82692 2.057429 -3.23481
H  -0.15229 -2.269116 -0.837209
H  1.471723 -1.039844 2.398939
H  1.900956 -1.761573 -1.805106
H  3.753904 -0.17799 2.482557
H  4.204627 -0.901838 -1.712182
H  5.142674 -0.090672 0.433033
elementType: N C H
totalener: -867.66534705 hartree
nucrepener: 1773.46628439 hartree
electener: -2641.13163143 hartree
oneelecener: -4698.34482074 hartree
twoeener: 2057.21318930 hartree
cpcmener: -0.02310775 hartree
kineticenergy: 863.63465290 hartree
xcener: -88.224911942720 hartree
chargesum: 0.0000000
charge: -0.228054 -0.090378 0.213256 -0.093045 0.013074 -0.059163 -0.181880 -0.202474 -0.254769 -0.218938 -0.110631 -0.142609 -0.104293 -0.151487 -0.149205 -0.133716 0.120183 -0.268378 -0.210853 -0.145387 -0.164556 -0.158672 0.108554 0.119095 0.107311 0.097326 0.130939 0.080840 0.100326 0.100002 0.138968 0.140144 0.156995 0.140121 0.127573 0.156898 0.157771 0.102755 0.140255 0.139283 0.158982 0.157091 0.160748
qa: -0.2281 -0.0904 0.2133 -0.0930 0.0131 -0.0592 -0.1819 -0.2025 -0.2548 -0.2189 -0.1106 -0.1426 -0.1043 -0.1515 -0.1492 -0.1337 0.1202 -0.2684 -0.2109 -0.1454 -0.1646 -0.1587 0.1086 0.1191 0.1073 0.0973 0.1309 0.0808 0.1003 0.1000 0.1390 0.1401 0.1570 0.1401 0.1276 0.1569 0.1578 0.1028 0.1403 0.1393 0.1590 0.1571 0.1607
va: 2.7850 3.7835 3.3381 3.7475 3.6852 3.9245 3.8796 3.9448 3.9286 3.9018 3.8386 3.8224 3.7810 3.9014 3.8703 3.8106 3.5198 3.9261 3.8950 3.8663 3.8786 3.8705 1.0106 0.9925 0.9961 1.0128 1.0100 1.0006 0.9976 0.9959 1.0288 1.0074 0.9891 1.0071 1.0011 0.9915 0.9893 1.0372 1.0152 1.0115 0.9904 0.9917 0.9884
dispcorr: -0.025606783 hartree
energy: -867.690953828519
dipole: -9.10138 8.48955 -0.61184 -5.66465 5.65874 -0.00591 0.59320 -0.25588 0.33732
magnitude: 0.69869 au
magnitude: 1.77592 debye
