program: Orca
programVersion: 5.0.2
elementType: N C C C C C C C C C C C C C C C C C C C C C H H H H H H H H H H H H H H H H H H H H H
charge: 0
multiplicity: 1
keywords: wb97x-d3
keywords: def2-TZVPP
keywords: def2/J RIJCOSX
keywords: DEFGRID2
keywords: scfconv7
keywords: smallprint printgap noloewdin
keywords: NOSOSCF
formula: C21H21N
InChI: InChI=1/C21H21N/c1-22(16-8-11-18-9-3-2-4-10-18)17-20-14-7-13-19-12-5-6-15-21(19)20/h2-15H,16-17H2,1H3
43 atoms
N  -0.403803 0.464545 0.810387
C  -1.011153 -0.00627 -0.428865
C  -1.343106 1.117186 -1.373908
C  -2.405438 2.029958 -1.105342
C  -2.638729 3.106623 -2.00435
C  -0.307077 -0.600428 1.805787
C  -0.595521 1.283403 -2.512009
C  0.876995 1.101809 0.578221
C  -3.255174 1.904484 0.021306
C  -1.83132 3.241213 -3.158265
C  -0.836233 2.341052 -3.411385
C  -3.680914 4.025639 -1.735488
C  0.639028 -1.714304 1.462039
C  -4.262204 2.80298 0.250095
C  -4.473987 3.882336 -0.631019
C  1.810747 -1.881442 2.078236
C  2.833093 -2.889611 1.781628
C  2.624508 -3.960571 0.906618
C  4.085788 -2.768621 2.38783
C  3.63952 -4.864373 0.639669
C  5.104048 -3.671635 2.118847
C  4.885575 -4.723841 1.241442
H  -1.917447 -0.56115 -0.170793
H  -0.361403 -0.713342 -0.965045
H  -1.313212 -1.002063 1.957761
H  -0.001041 -0.149903 2.753531
H  0.208826 0.587995 -2.720966
H  0.746952 2.018186 0.00242
H  1.601869 0.473629 0.042483
H  1.324717 1.382952 1.532498
H  -3.113828 1.084876 0.712044
H  -2.019277 4.063842 -3.837472
H  -0.222165 2.438471 -4.297081
H  -3.841439 4.846348 -2.42436
H  0.350003 -2.373259 0.648105
H  -4.901381 2.684858 1.115431
H  -5.267048 4.591359 -0.432984
H  2.071355 -1.187263 2.87399
H  1.661486 -4.096166 0.430608
H  4.264845 -1.948763 3.073442
H  3.457418 -5.686286 -0.040696
H  6.068108 -3.551753 2.595978
H  5.676211 -5.4313 1.028494
elementType: N C H
totalener: -867.67126205 hartree
nucrepener: 1576.83488057 hartree
electener: -2444.50614262 hartree
oneelecener: -4303.92605702 hartree
twoeener: 1859.41991441 hartree
cpcmener: -0.02284113 hartree
kineticenergy: 863.62029516 hartree
xcener: -88.218796050120 hartree
chargesum: -0.0000000
charge: -0.217583 -0.020203 0.043830 -0.083566 -0.033801 -0.042620 -0.136293 -0.232728 -0.255095 -0.151780 -0.145545 -0.101568 -0.157082 -0.159295 -0.156942 -0.105371 0.063922 -0.225908 -0.174054 -0.157205 -0.169143 -0.162452 0.114605 0.104132 0.098462 0.100444 0.133532 0.111528 0.084612 0.110103 0.148761 0.145071 0.158815 0.143971 0.125605 0.158811 0.160030 0.114923 0.144301 0.142360 0.159588 0.159111 0.161714
qa: -0.2176 -0.0202 0.0438 -0.0836 -0.0338 -0.0426 -0.1363 -0.2327 -0.2551 -0.1518 -0.1455 -0.1016 -0.1571 -0.1593 -0.1569 -0.1054 0.0639 -0.2259 -0.1741 -0.1572 -0.1691 -0.1625 0.1146 0.1041 0.0985 0.1004 0.1335 0.1115 0.0846 0.1101 0.1488 0.1451 0.1588 0.1440 0.1256 0.1588 0.1600 0.1149 0.1443 0.1424 0.1596 0.1591 0.1617
va: 2.7850 3.7405 3.5147 3.8728 3.8416 3.9570 3.8877 3.9682 4.0034 3.9248 3.9098 3.8713 3.7400 3.9301 3.9025 3.8168 3.6646 3.9633 3.9300 3.8969 3.9008 3.8874 0.9923 1.0059 1.0009 1.0030 1.0109 0.9916 0.9931 0.9962 1.0136 1.0046 0.9906 1.0049 1.0084 0.9924 0.9893 1.0205 1.0112 1.0080 0.9911 0.9912 0.9889
dispcorr: -0.018308044 hartree
energy: -867.689570090042
dipole: 4.38997 -4.13173 0.25823 -2.43994 2.09897 -0.34096 3.49262 -3.62305 -0.13044
magnitude: 0.44716 au
magnitude: 1.13660 debye
