program: Orca
programVersion: 5.0.2
elementType: N C C C C C C C C C C C C C C C C C C C C C H H H H H H H H H H H H H H H H H H H H H
charge: 0
multiplicity: 1
keywords: wb97x-d3
keywords: def2-TZVPP
keywords: def2/J RIJCOSX
keywords: DEFGRID2
keywords: scfconv7
keywords: smallprint printgap noloewdin
keywords: NOSOSCF
formula: C21H21N
InChI: InChI=1/C21H21N/c1-22(16-8-11-18-9-3-2-4-10-18)17-20-14-7-13-19-12-5-6-15-21(19)20/h2-15H,16-17H2,1H3
43 atoms
N  -1.977448 -1.116582 0.403287
C  -2.980689 -0.341357 -0.302146
C  -2.396544 0.61269 -1.310984
C  -1.493139 1.646411 -0.920825
C  -0.969025 2.518226 -1.914047
C  -1.222506 -2.017802 -0.439462
C  -2.749511 0.500378 -2.631632
C  -2.543651 -1.80042 1.543653
C  -1.104292 1.858449 0.425226
C  -1.364123 2.359465 -3.26342
C  -2.243579 1.376076 -3.612977
C  -0.064949 3.539648 -1.537908
C  0.162023 -2.288769 0.07059
C  -0.231943 2.858791 0.759596
C  0.300058 3.707003 -0.231258
C  0.818206 -1.498118 0.920033
C  2.178116 -1.702123 1.427592
C  2.873363 -0.607701 1.949076
C  2.812619 -2.947875 1.431454
C  4.163644 -0.744841 2.43921
C  4.100447 -3.086502 1.924031
C  4.783964 -1.986304 2.428223
H  -3.538921 0.227653 0.448458
H  -3.722896 -0.979173 -0.808888
H  -1.129367 -1.586959 -1.442228
H  -1.746342 -2.976513 -0.590923
H  -3.435952 -0.283174 -2.930865
H  -2.995473 -1.082658 2.230937
H  -1.766122 -2.33239 2.092898
H  -3.317761 -2.533983 1.268618
H  -1.490157 1.211719 1.19967
H  -0.962618 3.03273 -4.011511
H  -2.552055 1.257322 -4.643713
H  0.331592 4.193177 -2.30602
H  0.64019 -3.175715 -0.335664
H  0.05278 2.9996 1.794674
H  0.993522 4.490727 0.045486
H  0.320215 -0.598836 1.269465
H  2.395309 0.365309 1.962248
H  2.290227 -3.823335 1.065524
H  4.683001 0.119278 2.834147
H  4.570388 -4.061992 1.925769
H  5.787397 -2.099257 2.818219
elementType: N C H
totalener: -867.68176727 hartree
nucrepener: 1648.92933466 hartree
electener: -2516.61110193 hartree
oneelecener: -4448.38560309 hartree
twoeener: 1931.77450116 hartree
cpcmener: -0.01768116 hartree
kineticenergy: 863.62070582 hartree
xcener: -88.221215907685 hartree
chargesum: 0.0000000
charge: -0.217717 -0.053361 0.123097 -0.068970 -0.049992 -0.043799 -0.139751 -0.194770 -0.297475 -0.149601 -0.138144 -0.087060 -0.129560 -0.142915 -0.157282 -0.087217 0.041808 -0.174845 -0.213594 -0.180177 -0.167170 -0.149833 0.120130 0.094679 0.103741 0.085142 0.131066 0.094995 0.103149 0.086490 0.146632 0.140801 0.154287 0.140244 0.114124 0.153855 0.155900 0.113655 0.137357 0.137199 0.153477 0.154202 0.157203
qa: -0.2177 -0.0534 0.1231 -0.0690 -0.0500 -0.0438 -0.1398 -0.1948 -0.2975 -0.1496 -0.1381 -0.0871 -0.1296 -0.1429 -0.1573 -0.0872 0.0418 -0.1748 -0.2136 -0.1802 -0.1672 -0.1498 0.1201 0.0947 0.1037 0.0851 0.1311 0.0950 0.1031 0.0865 0.1466 0.1408 0.1543 0.1402 0.1141 0.1539 0.1559 0.1137 0.1374 0.1372 0.1535 0.1542 0.1572
va: 2.8017 3.7606 3.4736 3.7820 3.8879 3.9572 3.9020 3.9347 3.9031 3.9342 3.9057 3.8657 3.8235 3.8998 3.9206 3.7681 3.6556 3.9325 3.9667 3.9253 3.9194 3.8835 0.9885 1.0087 0.9982 1.0059 1.0101 0.9980 0.9930 1.0041 1.0238 1.0057 0.9918 1.0055 1.0168 0.9934 0.9900 1.0346 1.0088 1.0102 0.9942 0.9933 0.9904
dispcorr: -0.019856411 hartree
energy: -867.701623684078
dipole: -4.43278 3.89774 -0.53504 -7.18065 6.85128 -0.32937 3.68904 -3.87931 -0.19027
magnitude: 0.65647 au
magnitude: 1.66861 debye
