program: Orca
programVersion: 5.0.2
elementType: N C C C C C C C C C C C C C C C C C C C C C H H H H H H H H H H H H H H H H H H H H H
charge: 0
multiplicity: 1
keywords: wb97x-d3
keywords: def2-TZVPP
keywords: def2/J RIJCOSX
keywords: DEFGRID2
keywords: scfconv7
keywords: smallprint printgap noloewdin
keywords: NOSOSCF
formula: C21H21N
InChI: InChI=1/C21H21N/c1-22(16-8-11-18-9-3-2-4-10-18)17-20-14-7-13-19-12-5-6-15-21(19)20/h2-15H,16-17H2,1H3
43 atoms
N  -1.954199 -0.834318 0.475524
C  -1.325859 -0.735788 -0.833069
C  -1.723004 0.497233 -1.598557
C  -1.338329 1.798835 -1.159856
C  -1.723269 2.931179 -1.928954
C  -1.391921 -1.93598 1.243137
C  -2.448289 0.372193 -2.755699
C  -3.391106 -0.96683 0.368256
C  -0.567032 2.015036 0.008312
C  -2.473971 2.748795 -3.113973
C  -2.826092 1.494174 -3.520122
C  -1.33971 4.224505 -1.503108
C  0.047688 -1.711579 1.57553
C  -0.203318 3.278014 0.390291
C  -0.5971 4.397803 -0.368529
C  1.01337 -2.591568 1.309259
C  2.441317 -2.443172 1.606609
C  3.266185 -3.568327 1.538759
C  3.025433 -1.215487 1.934117
C  4.625491 -3.477979 1.800613
C  4.383091 -1.123878 2.192547
C  5.190305 -2.25404 2.128747
H  -1.552992 -1.620218 -1.45131
H  -0.241205 -0.735756 -0.694384
H  -1.511807 -2.905631 0.731085
H  -1.960787 -2.006789 2.176302
H  -2.739531 -0.615617 -3.093266
H  -3.833156 -1.032597 1.363821
H  -3.70633 -1.857704 -0.198256
H  -3.824818 -0.094358 -0.120949
H  -0.263695 1.171372 0.611977
H  -2.758747 3.618236 -3.694526
H  -3.396097 1.352635 -4.429374
H  -1.643838 5.079593 -2.095394
H  0.274424 -0.774476 2.07745
H  0.389908 3.420144 1.284746
H  -0.308929 5.391901 -0.051545
H  0.737325 -3.525886 0.826167
H  2.834011 -4.527818 1.278978
H  2.420654 -0.31775 1.970651
H  5.243551 -4.365059 1.744784
H  4.817329 -0.162415 2.436072
H  6.251921 -2.177479 2.325559
elementType: N C H
totalener: -867.68525017 hartree
nucrepener: 1608.57450016 hartree
electener: -2476.25975033 hartree
oneelecener: -4367.32344013 hartree
twoeener: 1891.06368980 hartree
cpcmener: -0.01878751 hartree
kineticenergy: 863.61921955 hartree
xcener: -88.217735623925 hartree
chargesum: -0.0000000
charge: -0.216136 -0.034195 0.020577 -0.049043 -0.039466 -0.050625 -0.126974 -0.215668 -0.226613 -0.138828 -0.145310 -0.104645 -0.147682 -0.162388 -0.151679 -0.074981 0.057772 -0.181220 -0.208146 -0.164220 -0.161324 -0.155823 0.102198 0.124043 0.078110 0.099499 0.128009 0.103342 0.081598 0.105232 0.134671 0.141040 0.154043 0.140631 0.117003 0.152062 0.155213 0.112814 0.138360 0.140063 0.155105 0.156011 0.157571
qa: -0.2161 -0.0342 0.0206 -0.0490 -0.0395 -0.0506 -0.1270 -0.2157 -0.2266 -0.1388 -0.1453 -0.1046 -0.1477 -0.1624 -0.1517 -0.0750 0.0578 -0.1812 -0.2081 -0.1642 -0.1613 -0.1558 0.1022 0.1240 0.0781 0.0995 0.1280 0.1033 0.0816 0.1052 0.1347 0.1410 0.1540 0.1406 0.1170 0.1521 0.1552 0.1128 0.1384 0.1401 0.1551 0.1560 0.1576
va: 2.8127 3.6708 3.5031 3.8188 3.8735 3.9555 3.9008 3.9666 3.9797 3.9249 3.9196 3.8777 3.8513 3.9475 3.9016 3.8272 3.6759 3.9478 3.9563 3.9057 3.9172 3.8934 1.0169 0.9931 1.0098 0.9934 1.0139 0.9979 1.0019 0.9903 1.0249 1.0055 0.9922 1.0059 1.0188 0.9940 0.9909 1.0196 1.0089 1.0085 0.9924 0.9926 0.9903
dispcorr: -0.018637386 hartree
energy: -867.703887554166
dipole: -4.45916 4.29666 -0.16250 -6.44090 6.03443 -0.40647 2.71657 -2.81115 -0.09458
magnitude: 0.44785 au
magnitude: 1.13834 debye
