program: Orca
programVersion: 5.0.2
elementType: N C C C C C C C C C C C C C C C C C C C C C H H H H H H H H H H H H H H H H H H H H H
charge: 0
multiplicity: 1
keywords: wb97x-d3
keywords: def2-TZVPP
keywords: def2/J RIJCOSX
keywords: DEFGRID2
keywords: scfconv7
keywords: smallprint printgap noloewdin
keywords: NOSOSCF
formula: C21H21N
InChI: InChI=1/C21H21N/c1-22(16-8-11-18-9-3-2-4-10-18)17-20-14-7-13-19-12-5-6-15-21(19)20/h2-15H,16-17H2,1H3
43 atoms
N  -3.096291 -0.82161 0.677143
C  -3.139256 -0.180436 -0.630696
C  -1.798478 0.228695 -1.176734
C  -0.995652 1.219948 -0.540211
C  0.290246 1.51366 -1.069884
C  -2.166094 -1.940759 0.755418
C  -1.329745 -0.379737 -2.312297
C  -4.436562 -1.200577 1.069918
C  -1.416882 1.918308 0.617295
C  0.737534 0.84262 -2.23213
C  -0.062659 -0.076035 -2.847699
C  1.1100 2.467055 -0.422068
C  -0.769816 -1.485248 1.038473
C  -0.605463 2.844087 1.217138
C  0.675521 3.117735 0.699116
C  0.322738 -1.911497 0.405965
C  1.686717 -1.419468 0.62172
C  2.678499 -1.757718 -0.302163
C  2.034427 -0.565885 1.674186
C  3.96268 -1.243813 -0.198643
C  3.316561 -0.053007 1.779237
C  4.287076 -0.38317 0.840346
H  -3.788024 0.697429 -0.54384
H  -3.61643 -0.838188 -1.375573
H  -2.194819 -2.587428 -0.135863
H  -2.489932 -2.568609 1.592152
H  -1.939027 -1.129983 -2.802275
H  -5.086993 -0.323814 1.068348
H  -4.434445 -1.604035 2.083269
H  -4.896268 -1.952147 0.409344
H  -2.38751 1.707997 1.0439
H  1.721669 1.070098 -2.624536
H  0.27538 -0.585239 -3.741204
H  2.092772 2.672834 -0.829959
H  -0.691565 -0.744033 1.828107
H  -0.947185 3.366418 2.101806
H  1.311226 3.84387 1.189364
H  0.209505 -2.628406 -0.403205
H  2.431463 -2.416624 -1.126584
H  1.298117 -0.288248 2.418036
H  4.70979 -1.513575 -0.934389
H  3.560058 0.611351 2.598862
H  5.286953 0.022942 0.922822
elementType: N C H
totalener: -867.67977282 hartree
nucrepener: 1759.25286757 hartree
electener: -2626.93264039 hartree
oneelecener: -4669.61490271 hartree
twoeener: 2042.68226232 hartree
cpcmener: -0.01909249 hartree
kineticenergy: 863.63007176 hartree
xcener: -88.224377763986 hartree
chargesum: -0.0000000
charge: -0.218054 -0.071562 0.199220 -0.051819 -0.003983 -0.068924 -0.188609 -0.204078 -0.268470 -0.220038 -0.102390 -0.138648 -0.073794 -0.142220 -0.142121 -0.125666 0.101052 -0.200961 -0.246023 -0.148313 -0.148792 -0.164029 0.114361 0.101107 0.090598 0.102806 0.125164 0.098430 0.097797 0.081096 0.134994 0.136275 0.153081 0.136447 0.096999 0.154222 0.155852 0.108584 0.134995 0.138444 0.154764 0.155040 0.157164
qa: -0.2181 -0.0716 0.1992 -0.0518 -0.0040 -0.0689 -0.1886 -0.2041 -0.2685 -0.2200 -0.1024 -0.1386 -0.0738 -0.1422 -0.1421 -0.1257 0.1011 -0.2010 -0.2460 -0.1483 -0.1488 -0.1640 0.1144 0.1011 0.0906 0.1028 0.1252 0.0984 0.0978 0.0811 0.1350 0.1363 0.1531 0.1364 0.0970 0.1542 0.1559 0.1086 0.1350 0.1384 0.1548 0.1550 0.1572
va: 2.8031 3.7970 3.3681 3.7621 3.6909 3.9403 3.9255 3.9519 3.9339 3.9107 3.8490 3.8440 3.7648 3.9160 3.8858 3.8355 3.5577 3.9223 3.9208 3.8876 3.8780 3.8888 0.9928 1.0063 1.0102 0.9942 1.0137 0.9947 0.9965 0.9975 1.0372 1.0083 0.9906 1.0076 1.0328 0.9921 0.9894 1.0219 1.0119 1.0122 0.9910 0.9922 0.9900
dispcorr: -0.024931975 hartree
energy: -867.704704792546
dipole: -8.97313 8.47598 -0.49715 -5.00403 4.71159 -0.29244 2.56823 -2.73326 -0.16502
magnitude: 0.59993 au
magnitude: 1.52490 debye
