program: Orca
programVersion: 5.0.2
elementType: N C C C C C C C C C C C C C C C C C C C C C H H H H H H H H H H H H H H H H H H H H H
charge: 0
multiplicity: 1
keywords: wb97x-d3
keywords: def2-TZVPP
keywords: def2/J RIJCOSX
keywords: DEFGRID2
keywords: scfconv7
keywords: smallprint printgap noloewdin
keywords: NOSOSCF
formula: C21H21N
InChI: InChI=1/C21H21N/c1-22(16-8-11-18-9-3-2-4-10-18)17-20-14-7-13-19-12-5-6-15-21(19)20/h2-15H,16-17H2,1H3
43 atoms
N  -2.67587 -1.731009 -0.284053
C  -2.04493 -0.943787 -1.332102
C  -2.043072 0.535163 -1.025851
C  -0.864363 1.336041 -1.082564
C  -0.955385 2.721124 -0.758869
C  -2.01109 -1.61412 1.007866
C  -3.235015 1.127721 -0.68491
C  -2.84502 -3.104854 -0.707317
C  0.411393 0.827869 -1.441074
C  -2.204729 3.280087 -0.412065
C  -3.324296 2.497212 -0.38179
C  0.21033 3.524308 -0.784359
C  -0.553446 -1.973183 1.017899
C  1.519026 1.629998 -1.459726
C  1.422887 2.994922 -1.12361
C  0.399304 -1.107516 1.36861
C  1.847883 -1.330913 1.377546
C  2.68972 -0.227896 1.542535
C  2.435016 -2.589028 1.209599
C  4.069415 -0.369022 1.524464
C  3.812747 -2.731128 1.193023
C  4.637555 -1.622436 1.347298
H  -2.621525 -1.103552 -2.248565
H  -1.034724 -1.305933 -1.556375
H  -2.554087 -2.256715 1.708202
H  -2.131228 -0.591794 1.375706
H  -4.131413 0.521406 -0.641289
H  -1.908758 -3.624753 -0.957343
H  -3.480435 -3.142809 -1.594381
H  -3.342775 -3.677168 0.07715
H  0.525856 -0.212997 -1.70701
H  -2.26063 4.335536 -0.173256
H  -4.284284 2.925165 -0.122506
H  0.122774 4.5735 -0.52757
H  -0.292593 -2.979911 0.70251
H  2.47908 1.210729 -1.73256
H  2.308076 3.617672 -1.136739
H  0.093599 -0.103708 1.654276
H  2.253434 0.754707 1.680516
H  1.814852 -3.469686 1.096565
H  4.700286 0.501961 1.648848
H  4.247462 -3.714138 1.062281
H  5.713767 -1.737693 1.3321
elementType: N C H
totalener: -867.68063796 hartree
nucrepener: 1689.33649627 hartree
electener: -2557.01713424 hartree
oneelecener: -4529.03765616 hartree
twoeener: 1972.02052192 hartree
cpcmener: -0.01794012 hartree
kineticenergy: 863.61559016 hartree
xcener: -88.222611809003 hartree
chargesum: 0.0000000
charge: -0.207002 -0.077944 0.142833 -0.084043 -0.013307 -0.047207 -0.215699 -0.204021 -0.248523 -0.150722 -0.131848 -0.085527 -0.128643 -0.157481 -0.153927 -0.130499 0.089689 -0.206882 -0.219403 -0.156238 -0.152888 -0.157463 0.116009 0.104840 0.104631 0.096941 0.122810 0.077276 0.099586 0.100224 0.145822 0.139566 0.155086 0.139126 0.123194 0.154039 0.155765 0.114872 0.139567 0.139283 0.154758 0.155708 0.157640
qa: -0.2070 -0.0779 0.1428 -0.0840 -0.0133 -0.0472 -0.2157 -0.2040 -0.2485 -0.1507 -0.1318 -0.0855 -0.1286 -0.1575 -0.1539 -0.1305 0.0897 -0.2069 -0.2194 -0.1562 -0.1529 -0.1575 0.1160 0.1048 0.1046 0.0969 0.1228 0.0773 0.0996 0.1002 0.1458 0.1396 0.1551 0.1391 0.1232 0.1540 0.1558 0.1149 0.1396 0.1393 0.1548 0.1557 0.1576
va: 2.8475 3.8256 3.4381 3.7112 3.8585 3.9463 3.9486 3.9574 3.8841 3.9382 3.9046 3.8689 3.7459 3.8805 3.9033 3.8543 3.5728 3.9198 3.9756 3.9014 3.9044 3.8980 0.9934 1.0003 0.9979 0.9996 1.0368 0.9931 0.9956 0.9966 1.0118 1.0063 0.9911 1.0061 1.0039 0.9948 0.9903 1.0147 1.0077 1.0111 0.9925 0.9922 0.9900
dispcorr: -0.021939603 hartree
energy: -867.702577563457
dipole: -3.51130 3.73421 0.22292 -8.94173 8.57043 -0.37131 -0.10539 0.00002 -0.10537
magnitude: 0.44572 au
magnitude: 1.13293 debye
