program: Orca
programVersion: 5.0.2
elementType: N C C C C C C C C C C C C C C C C C C C C C H H H H H H H H H H H H H H H H H H H H H
charge: 0
multiplicity: 1
keywords: wb97x-d3
keywords: def2-TZVPP
keywords: def2/J RIJCOSX
keywords: DEFGRID2
keywords: scfconv7
keywords: smallprint printgap noloewdin
keywords: NOSOSCF
formula: C21H21N
InChI: InChI=1/C21H21N/c1-22(16-8-11-18-9-3-2-4-10-18)17-20-14-7-13-19-12-5-6-15-21(19)20/h2-15H,16-17H2,1H3
43 atoms
N  -1.293241 -1.222258 -0.304758
C  -0.843199 0.051518 -0.826566
C  -1.966682 1.039327 -1.050713
C  -1.677073 2.425744 -1.22798
C  -2.746342 3.3367 -1.452825
C  -0.409981 -2.330969 -0.643798
C  -3.269424 0.619072 -1.125176
C  -1.576453 -1.153896 1.113265
C  -0.35883 2.944556 -1.198289
C  -4.074184 2.854808 -1.510705
C  -4.325731 1.522583 -1.354186
C  -2.465596 4.712673 -1.619626
C  0.979062 -2.248837 -0.074994
C  -0.117925 4.281846 -1.3648
C  -1.181491 5.179564 -1.574184
C  1.419113 -3.041895 0.903583
C  2.745577 -3.025233 1.527615
C  2.961393 -3.803458 2.6676
C  3.813229 -2.265458 1.038561
C  4.191526 -3.813418 3.308412
C  5.042155 -2.276154 1.676451
C  5.238188 -3.047597 2.8164
H  -0.34871 -0.120977 -1.788423
H  -0.081772 0.502366 -0.173702
H  -0.350405 -2.386203 -1.735011
H  -0.887939 -3.254389 -0.306159
H  -3.493814 -0.431814 -1.000367
H  -1.962604 -2.112472 1.463203
H  -2.342832 -0.403534 1.309576
H  -0.701312 -0.899565 1.728496
H  0.481558 2.281319 -1.045601
H  -4.881745 3.556053 -1.683252
H  -5.340879 1.149697 -1.402773
H  -3.290747 5.394934 -1.786213
H  1.627638 -1.481997 -0.490755
H  0.898822 4.651758 -1.335147
H  -0.97838 6.235042 -1.700937
H  0.734458 -3.784389 1.308101
H  2.150516 -4.406557 3.059277
H  3.690331 -1.66462 0.146241
H  4.331326 -4.421466 4.193127
H  5.855581 -1.681691 1.280095
H  6.199787 -3.052674 3.313108
elementType: N C H
totalener: -867.68251093 hartree
nucrepener: 1567.49023891 hartree
electener: -2435.17274983 hartree
oneelecener: -4284.96813042 hartree
twoeener: 1849.79538058 hartree
cpcmener: -0.01888397 hartree
kineticenergy: 863.61830510 hartree
xcener: -88.221199078889 hartree
chargesum: 0.0000000
charge: -0.189545 -0.041491 0.160216 -0.148456 0.004807 -0.051437 -0.242508 -0.204536 -0.225287 -0.163301 -0.131459 -0.108437 -0.148378 -0.167462 -0.145809 -0.108180 0.063870 -0.169763 -0.215945 -0.166495 -0.156821 -0.156820 0.114165 0.096465 0.095888 0.100581 0.137757 0.102936 0.110061 0.085940 0.145143 0.140187 0.153865 0.139381 0.119957 0.154149 0.156103 0.112052 0.138818 0.139973 0.155594 0.156562 0.157661
qa: -0.1895 -0.0415 0.1602 -0.1485 0.0048 -0.0514 -0.2425 -0.2045 -0.2253 -0.1633 -0.1315 -0.1084 -0.1484 -0.1675 -0.1458 -0.1082 0.0639 -0.1698 -0.2159 -0.1665 -0.1568 -0.1568 0.1142 0.0965 0.0959 0.1006 0.1378 0.1029 0.1101 0.0859 0.1451 0.1402 0.1539 0.1394 0.1200 0.1541 0.1561 0.1121 0.1388 0.1400 0.1556 0.1566 0.1577
va: 2.8668 3.8568 3.4332 3.9730 3.8060 3.9577 3.9486 3.9228 3.9730 3.9444 3.9249 3.8829 3.7464 3.9394 3.9025 3.8340 3.6758 3.9361 3.9673 3.9079 3.9073 3.8947 0.9900 0.9892 1.0023 0.9991 1.0425 0.9978 0.9944 1.0003 1.0077 1.0063 0.9929 1.0069 1.0090 0.9943 0.9905 1.0211 1.0086 1.0120 0.9922 0.9921 0.9903
dispcorr: -0.017633861 hartree
energy: -867.700144787140
dipole: 1.23811 -0.79608 0.44204 -5.95042 5.87303 -0.07739 3.18178 -3.03536 0.14642
magnitude: 0.47204 au
magnitude: 1.19983 debye
