program: Orca
programVersion: 5.0.2
elementType: N C C C C C C C C C C C C C C C C C C C C C H H H H H H H H H H H H H H H H H H H H H
charge: 0
multiplicity: 1
keywords: wb97x-d3
keywords: def2-TZVPP
keywords: def2/J RIJCOSX
keywords: DEFGRID2
keywords: scfconv7
keywords: smallprint printgap noloewdin
keywords: NOSOSCF
formula: C21H21N
InChI: InChI=1/C21H21N/c1-22(16-8-11-18-9-3-2-4-10-18)17-20-14-7-13-19-12-5-6-15-21(19)20/h2-15H,16-17H2,1H3
43 atoms
N  -1.223294 -0.877103 0.220466
C  -2.14519 0.238422 0.140528
C  -1.751073 1.277777 -0.882956
C  -2.319071 2.586422 -0.83631
C  -1.927896 3.549214 -1.807842
C  -0.003675 -0.505495 0.923186
C  -0.869876 0.973402 -1.889119
C  -1.847706 -2.0312 0.831549
C  -3.27337 2.97556 0.136589
C  -1.001255 3.191215 -2.813901
C  -0.491823 1.925805 -2.85534
C  -2.475495 4.852192 -1.756739
C  1.104395 -1.477273 0.681207
C  -3.791728 4.242398 0.155858
C  -3.385945 5.196097 -0.796727
C  1.814011 -2.051223 1.653692
C  2.936399 -2.980168 1.492028
C  3.53269 -3.253448 0.256488
C  3.435885 -3.634186 2.620782
C  4.572201 -4.162605 0.156287
C  4.478488 -4.54391 2.521704
C  5.049582 -4.815659 1.287094
H  -2.274842 0.71121 1.126285
H  -3.131531 -0.152021 -0.129741
H  -0.176343 -0.387536 2.005967
H  0.317499 0.473894 0.555082
H  -0.445733 -0.020762 -1.937363
H  -2.184191 -1.850579 1.863996
H  -1.150886 -2.869313 0.856427
H  -2.713953 -2.343478 0.247154
H  -3.611595 2.265154 0.878683
H  -0.708662 3.931717 -3.5486
H  0.211486 1.644846 -3.628967
H  -2.161566 5.577176 -2.498438
H  1.324301 -1.682785 -0.362706
H  -4.519858 4.513428 0.909585
H  -3.799039 6.196133 -0.767745
H  1.540965 -1.835709 2.683807
H  3.188143 -2.750431 -0.638425
H  2.995694 -3.430389 3.590062
H  5.017231 -4.360128 -0.810739
H  4.844045 -5.040558 3.411501
H  5.862182 -5.525919 1.204484
elementType: N C H
totalener: -867.68413680 hartree
nucrepener: 1560.06997313 hartree
electener: -2427.75410993 hartree
oneelecener: -4270.17800592 hartree
twoeener: 1842.42389599 hartree
cpcmener: -0.01833700 hartree
kineticenergy: 863.61904226 hartree
xcener: -88.219576741886 hartree
chargesum: -0.0000000
charge: -0.202119 -0.062332 0.150168 -0.126720 0.001119 -0.066711 -0.236280 -0.203002 -0.214920 -0.165322 -0.128832 -0.103332 -0.135244 -0.169059 -0.145782 -0.089616 0.054000 -0.211897 -0.174963 -0.160851 -0.163709 -0.156076 0.096652 0.114004 0.097116 0.123772 0.137115 0.078247 0.104130 0.099154 0.144658 0.139788 0.153910 0.139768 0.114087 0.154173 0.156276 0.111028 0.139806 0.138757 0.156038 0.155158 0.157841
qa: -0.2021 -0.0623 0.1502 -0.1267 0.0011 -0.0667 -0.2363 -0.2030 -0.2149 -0.1653 -0.1288 -0.1033 -0.1352 -0.1691 -0.1458 -0.0896 0.0540 -0.2119 -0.1750 -0.1609 -0.1637 -0.1561 0.0967 0.1140 0.0971 0.1238 0.1371 0.0782 0.1041 0.0992 0.1447 0.1398 0.1539 0.1398 0.1141 0.1542 0.1563 0.1110 0.1398 0.1388 0.1560 0.1552 0.1578
va: 2.8327 3.8745 3.4158 3.9484 3.8142 3.8685 3.9628 3.9511 3.9618 3.9460 3.9231 3.8806 3.8611 3.9396 3.9026 3.8764 3.6925 3.9620 3.9390 3.9117 3.9080 3.8925 1.0005 0.9896 1.0178 0.9867 1.0423 1.0007 0.9915 0.9971 1.0103 1.0065 0.9925 1.0065 1.0225 0.9942 0.9904 1.0235 1.0113 1.0089 0.9925 0.9924 0.9903
dispcorr: -0.017320217 hartree
energy: -867.701457016056
dipole: -1.55234 1.29169 -0.26064 -6.46956 6.47715 0.00760 4.78772 -4.36301 0.42471
magnitude: 0.49837 au
magnitude: 1.26675 debye
