program: Orca
programVersion: 5.0.2
elementType: N C C C C C C C C C C C C C C C C C C C C C H H H H H H H H H H H H H H H H H H H H H
charge: 0
multiplicity: 1
keywords: wb97x-d3
keywords: def2-TZVPP
keywords: def2/J RIJCOSX
keywords: DEFGRID2
keywords: scfconv7
keywords: smallprint printgap noloewdin
keywords: NOSOSCF
formula: C21H21N
InChI: InChI=1/C21H21N/c1-22(16-8-11-18-9-3-2-4-10-18)17-20-14-7-13-19-12-5-6-15-21(19)20/h2-15H,16-17H2,1H3
43 atoms
N  -3.135748 -1.535628 -0.03133
C  -2.968492 -0.097606 -0.191725
C  -1.717128 0.280917 -0.953486
C  -0.785188 1.251165 -0.481297
C  0.375798 1.530365 -1.256833
C  -2.275533 -2.078142 1.012744
C  -1.481764 -0.332162 -2.159193
C  -4.51969 -1.862084 0.244977
C  -0.929991 1.934624 0.751792
C  0.574696 0.866238 -2.487405
C  -0.341825 -0.043697 -2.930946
C  1.330499 2.459285 -0.77899
C  -0.825634 -1.946748 0.68512
C  0.007798 2.831185 1.18629
C  1.154069 3.100057 0.414473
C  0.050971 -1.301701 1.454067
C  1.458717 -1.047429 1.139753
C  2.189819 -0.193637 1.968448
C  2.097529 -1.573874 0.01177
C  3.509001 0.12881 1.684108
C  3.412021 -1.249884 -0.274949
C  4.12672 -0.397649 0.559903
H  -3.020929 0.411161 0.779281
H  -3.825996 0.271616 -0.761077
H  -2.521359 -3.140483 1.114671
H  -2.479695 -1.612567 1.992228
H  -2.184565 -1.071817 -2.521868
H  -4.63803 -2.943666 0.325414
H  -5.157566 -1.521463 -0.571759
H  -4.903305 -1.416716 1.176085
H  -1.794096 1.753071 1.374508
H  1.463513 1.085477 -3.067151
H  -0.193536 -0.555144 -3.873644
H  2.210502 2.653895 -1.380442
H  -0.514668 -2.398675 -0.251103
H  -0.130608 3.335493 2.134094
H  1.891438 3.807976 0.770317
H  -0.306836 -0.845287 2.373285
H  1.713484 0.231481 2.844057
H  1.566059 -2.238913 -0.657093
H  4.052026 0.796671 2.340735
H  3.884824 -1.666818 -1.155168
H  5.154751 -0.147634 0.332748
elementType: N C H
totalener: -867.67927878 hartree
nucrepener: 1763.79533203 hartree
electener: -2631.47461081 hartree
oneelecener: -4678.67117633 hartree
twoeener: 2047.19656552 hartree
cpcmener: -0.02002131 hartree
kineticenergy: 863.64742471 hartree
xcener: -88.229154672560 hartree
chargesum: 0.0000000
charge: -0.214424 -0.085047 0.260216 -0.079222 0.024826 -0.072416 -0.271069 -0.199260 -0.264073 -0.210616 -0.103071 -0.108335 -0.081891 -0.134462 -0.165545 -0.124997 0.108825 -0.197491 -0.246572 -0.163216 -0.146574 -0.151981 0.109724 0.115765 0.099837 0.080230 0.119376 0.098234 0.097638 0.079093 0.142031 0.135223 0.153281 0.135505 0.110035 0.152352 0.153223 0.108298 0.135713 0.136554 0.152898 0.155156 0.156226
qa: -0.2144 -0.0850 0.2602 -0.0792 0.0248 -0.0724 -0.2711 -0.1993 -0.2641 -0.2106 -0.1031 -0.1083 -0.0819 -0.1345 -0.1655 -0.1250 0.1088 -0.1975 -0.2466 -0.1632 -0.1466 -0.1520 0.1097 0.1158 0.0998 0.0802 0.1194 0.0982 0.0976 0.0791 0.1420 0.1352 0.1533 0.1355 0.1100 0.1524 0.1532 0.1083 0.1357 0.1366 0.1529 0.1552 0.1562
va: 2.8456 3.8311 3.2943 3.7264 3.7056 3.9752 3.9772 3.9539 3.9235 3.9292 3.8539 3.8043 3.7964 3.8666 3.8808 3.8465 3.5394 3.8983 3.9280 3.8914 3.8845 3.8804 1.0083 0.9941 0.9928 1.0112 1.0383 0.9956 0.9971 0.9977 1.0178 1.0082 0.9903 1.0076 1.0209 0.9926 0.9912 1.0206 1.0125 1.0141 0.9930 0.9915 0.9898
dispcorr: -0.025242596 hartree
energy: -867.704521379860
dipole: -9.12416 8.67268 -0.45148 -4.92308 4.98608 0.06301 3.24412 -2.92350 0.32062
magnitude: 0.55732 au
magnitude: 1.41659 debye
