program: Orca
programVersion: 5.0.2
elementType: N C C C C C C C C C C C C C C C C C C C C C H H H H H H H H H H H H H H H H H H H H H
charge: 0
multiplicity: 1
keywords: wb97x-d3
keywords: def2-TZVPP
keywords: def2/J RIJCOSX
keywords: DEFGRID2
keywords: scfconv7
keywords: smallprint printgap noloewdin
keywords: NOSOSCF
formula: C21H21N
InChI: InChI=1/C21H21N/c1-22(16-8-11-18-9-3-2-4-10-18)17-20-14-7-13-19-12-5-6-15-21(19)20/h2-15H,16-17H2,1H3
43 atoms
N  -1.776985 -0.716727 1.105759
C  -1.061239 0.549651 1.205016
C  -0.89499 1.337159 -0.080423
C  -1.821932 2.336375 -0.5069
C  -1.616867 2.98554 -1.757941
C  -1.106991 -1.735815 0.320152
C  0.190192 1.063526 -0.878426
C  -3.167144 -0.58176 0.734413
C  -2.937777 2.740799 0.268567
C  -0.495936 2.646461 -2.548878
C  0.39586 1.709987 -2.111105
C  -2.532624 3.972861 -2.192758
C  0.207621 -2.139925 0.906464
C  -3.802578 3.703975 -0.174486
C  -3.605274 4.324892 -1.423084
C  1.312792 -2.327859 0.183415
C  2.621144 -2.777384 0.668479
C  3.625094 -3.050226 -0.263733
C  2.921414 -2.939473 2.025062
C  4.882196 -3.47754 0.138596
C  4.176118 -3.364226 2.427649
C  5.163574 -3.637548 1.487366
H  -0.065268 0.336805 1.60067
H  -1.557457 1.150822 1.969231
H  -0.979724 -1.464462 -0.739959
H  -1.761755 -2.614606 0.325442
H  0.917897 0.332628 -0.546542
H  -3.675483 0.098118 1.418935
H  -3.661929 -1.551169 0.818999
H  -3.336123 -0.218283 -0.288995
H  -3.113899 2.292436 1.235868
H  -0.350864 3.148279 -3.498193
H  1.264729 1.460153 -2.706654
H  -2.364411 4.451494 -3.150472
H  0.206324 -2.323234 1.977575
H  -4.644086 3.994066 0.44167
H  -4.298609 5.082704 -1.764586
H  1.260953 -2.143445 -0.887181
H  3.41502 -2.927051 -1.320024
H  2.172973 -2.727765 2.778508
H  5.642475 -3.683956 -0.604038
H  4.387412 -3.481077 3.483128
H  6.143568 -3.968673 1.806196
elementType: N C H
totalener: -867.68176700 hartree
nucrepener: 1610.22681886 hartree
electener: -2477.90858586 hartree
oneelecener: -4370.44891168 hartree
twoeener: 1892.54032581 hartree
cpcmener: -0.01858368 hartree
kineticenergy: 863.61420503 hartree
xcener: -88.221758724091 hartree
chargesum: -0.0000000
charge: -0.182711 -0.119824 0.147719 -0.092077 -0.049293 -0.082810 -0.211261 -0.229138 -0.233515 -0.155753 -0.148795 -0.085336 -0.088416 -0.153998 -0.156264 -0.137126 0.063712 -0.176510 -0.215476 -0.163907 -0.158691 -0.157401 0.117748 0.120870 0.093429 0.106835 0.184695 0.100180 0.107604 0.090557 0.147261 0.139547 0.152461 0.139700 0.112401 0.153873 0.155603 0.116919 0.138443 0.141041 0.154869 0.155715 0.157125
qa: -0.1827 -0.1198 0.1477 -0.0921 -0.0493 -0.0828 -0.2113 -0.2291 -0.2335 -0.1558 -0.1488 -0.0853 -0.0884 -0.1540 -0.1563 -0.1371 0.0637 -0.1765 -0.2155 -0.1639 -0.1587 -0.1574 0.1177 0.1209 0.0934 0.1068 0.1847 0.1002 0.1076 0.0906 0.1473 0.1395 0.1525 0.1397 0.1124 0.1539 0.1556 0.1169 0.1384 0.1410 0.1549 0.1557 0.1571
va: 2.8816 3.9042 3.2332 3.7940 3.8922 3.9597 3.9061 3.9680 3.9525 3.9508 3.9452 3.8614 3.7546 3.9328 3.9157 3.8347 3.6725 3.9388 3.9617 3.9074 3.9098 3.8927 0.9972 0.9989 0.9991 0.9965 0.9688 0.9937 1.0001 0.9845 1.0079 1.0058 0.9936 1.0059 1.0286 0.9937 0.9906 1.0166 1.0093 1.0110 0.9926 0.9925 0.9905
dispcorr: -0.019399225 hartree
energy: -867.701166229686
dipole: -4.14539 3.99040 -0.15500 -4.55217 4.59747 0.04531 2.28112 -2.50340 -0.22228
magnitude: 0.27475 au
magnitude: 0.69835 debye
