program: Orca
programVersion: 5.0.2
elementType: N C C C C C C C C C C C C C C C C C C C C C H H H H H H H H H H H H H H H H H H H H H
charge: 0
multiplicity: 1
keywords: wb97x-d3
keywords: def2-TZVPP
keywords: def2/J RIJCOSX
keywords: DEFGRID2
keywords: scfconv7
keywords: smallprint printgap noloewdin
keywords: NOSOSCF
formula: C21H21N
InChI: InChI=1/C21H21N/c1-22(16-8-11-18-9-3-2-4-10-18)17-20-14-7-13-19-12-5-6-15-21(19)20/h2-15H,16-17H2,1H3
43 atoms
N  -2.888903 -0.955349 0.692332
C  -3.091927 -0.151159 -0.502758
C  -1.826227 0.218844 -1.226932
C  -0.880193 1.115752 -0.654444
C  0.319179 1.395865 -1.35646
C  -2.187977 -2.199947 0.417167
C  -1.571082 -0.326028 -2.45692
C  -4.149463 -1.176093 1.363264
C  -1.068338 1.709262 0.614081
C  0.539182 0.805299 -2.622462
C  -0.387677 -0.034837 -3.164254
C  1.287943 2.237608 -0.767218
C  -0.696027 -2.035542 0.306349
C  -0.11512 2.526347 1.15691
C  1.080352 2.78977 0.464092
C  0.010996 -1.289537 1.151771
C  1.438904 -0.984582 1.073849
C  2.060696 -0.36638 2.158573
C  2.207993 -1.23703 -0.064191
C  3.403921 -0.028757 2.121729
C  3.549366 -0.902487 -0.103976
C  4.15627 -0.297146 0.989001
H  -3.623422 0.758531 -0.20509
H  -3.756778 -0.66999 -1.215861
H  -2.574603 -2.689544 -0.49208
H  -2.408059 -2.893353 1.23487
H  -2.29178 -1.006666 -2.894907
H  -3.988222 -1.717998 2.295457
H  -4.879941 -1.744515 0.765305
H  -4.608505 -0.218864 1.615725
H  -1.96224 1.485686 1.179353
H  1.458418 1.026395 -3.151355
H  -0.219451 -0.485229 -4.133729
H  2.210526 2.426019 -1.30204
H  -0.210372 -2.552134 -0.514289
H  -0.2758 2.965668 2.132971
H  1.835557 3.421211 0.912366
H  -0.523518 -0.800763 1.960477
H  1.476174 -0.143259 3.043151
H  1.745877 -1.670841 -0.941426
H  3.862131 0.448979 2.978069
H  4.124641 -1.103741 -0.998625
H  5.204571 -0.031046 0.953016
totalener: -867.65560777 hartree
nucrepener: 1781.44037581 hartree
electener: -2649.09598358 hartree
oneelecener: -4712.87914875 hartree
twoeener: 2063.78316517 hartree
kineticenergy: 863.68110731 hartree
xcener: -88.234603328716 hartree
chargesum: 0.0000000
charge: -0.172500 -0.160474 0.145888 -0.019347 -0.025591 -0.074635 -0.112404 -0.182360 -0.177325 -0.144058 -0.118496 -0.064782 -0.074420 -0.128024 -0.115503 -0.084311 0.153592 -0.188137 -0.213538 -0.119866 -0.127166 -0.123056 0.107868 0.090834 0.081525 0.094953 0.097902 0.087017 0.076599 0.085248 0.116237 0.103776 0.121632 0.098646 0.093559 0.118623 0.116598 0.079399 0.098818 0.098702 0.118103 0.118461 0.122016
qa: -0.1725 -0.1605 0.1459 -0.0193 -0.0256 -0.0746 -0.1124 -0.1824 -0.1773 -0.1441 -0.1185 -0.0648 -0.0744 -0.1280 -0.1155 -0.0843 0.1536 -0.1881 -0.2135 -0.1199 -0.1272 -0.1231 0.1079 0.0908 0.0815 0.0950 0.0979 0.0870 0.0766 0.0852 0.1162 0.1038 0.1216 0.0986 0.0936 0.1186 0.1166 0.0794 0.0988 0.0987 0.1181 0.1185 0.1220
va: 2.8009 3.8702 3.4444 3.8502 3.8543 3.9430 3.9153 3.9596 3.9084 3.9546 3.9571 3.8804 3.8055 3.9604 3.9216 3.8678 3.5263 3.9920 3.9967 3.9438 3.9600 3.9505 0.9934 1.0113 1.0104 0.9964 1.0186 0.9993 0.9998 0.9984 1.0303 1.0146 1.0011 1.0156 1.0138 1.0018 1.0018 1.0413 1.0203 1.0240 1.0012 1.0017 0.9992
dispcorr: -0.026165333 hartree
energy: -867.681773102782
dipole: -8.77544 8.46286 -0.31259 -5.05995 4.96035 -0.09960 3.04668 -3.09575 -0.04906
magnitude: 0.33172 au
magnitude: 0.84317 debye
