program: Orca
programVersion: 5.0.2
elementType: N C C C C C C C C C C C C C C C C C C C C C H H H H H H H H H H H H H H H H H H H H H
charge: 0
multiplicity: 1
keywords: wb97x-d3
keywords: def2-TZVPP
keywords: def2/J RIJCOSX
keywords: DEFGRID2
keywords: scfconv7
keywords: smallprint printgap noloewdin
keywords: NOSOSCF
formula: C21H21N
InChI: InChI=1/C21H21N/c1-22(16-8-11-18-9-3-2-4-10-18)17-20-14-7-13-19-12-5-6-15-21(19)20/h2-15H,16-17H2,1H3
43 atoms
N  -3.122919 -1.525012 -0.047639
C  -2.97354 -0.087828 -0.19798
C  -1.700112 0.305201 -0.912012
C  -0.821276 1.315453 -0.429057
C  0.369313 1.596656 -1.154625
C  -2.263832 -2.066145 0.994079
C  -1.392737 -0.345682 -2.079169
C  -4.502197 -1.891086 0.179981
C  -1.049526 2.045012 0.762944
C  0.648508 0.888528 -2.342439
C  -0.221138 -0.058488 -2.799332
C  1.266101 2.575703 -0.671851
C  -0.811485 -1.95533 0.666342
C  -0.164881 2.990461 1.20363
C  1.00884 3.263784 0.478621
C  0.066579 -1.274428 1.399096
C  1.48084 -1.076853 1.079817
C  2.153205 0.011779 1.633347
C  2.184775 -1.915255 0.212846
C  3.477114 0.270768 1.316849
C  3.506283 -1.658811 -0.10399
C  4.159599 -0.562293 0.444749
H  -3.065285 0.417002 0.774528
H  -3.817713 0.272281 -0.79355
H  -2.520392 -3.124677 1.108333
H  -2.461254 -1.591944 1.972623
H  -2.056986 -1.124534 -2.431797
H  -4.59532 -2.976784 0.225101
H  -5.123724 -1.543491 -0.646019
H  -4.925137 -1.48238 1.111869
H  -1.942288 1.865844 1.344786
H  1.562308 1.105876 -2.881528
H  -0.009033 -0.600991 -3.711443
H  2.172656 2.768395 -1.232363
H  -0.499387 -2.442519 -0.251385
H  -0.371137 3.533767 2.116757
H  1.703771 4.012206 0.835973
H  -0.294347 -0.742308 2.27548
H  1.621664 0.677945 2.301748
H  1.696656 -2.783075 -0.211808
H  3.974408 1.128649 1.750411
H  4.034262 -2.321808 -0.777144
H  5.194682 -0.365527 0.197924
totalener: -867.65680341 hartree
nucrepener: 1762.76150027 hartree
electener: -2630.41830367 hartree
oneelecener: -4675.39133936 hartree
twoeener: 2044.97303568 hartree
kineticenergy: 863.67918329 hartree
xcener: -88.233704254357 hartree
chargesum: -0.0000000
charge: -0.172012 -0.114500 0.257792 -0.096181 0.045337 -0.092453 -0.225601 -0.184251 -0.225461 -0.145560 -0.079018 -0.069627 -0.076499 -0.140052 -0.121779 -0.067389 0.111753 -0.156817 -0.203135 -0.137696 -0.108071 -0.123577 0.090634 0.107133 0.086047 0.072397 0.107935 0.087481 0.086441 0.072956 0.115347 0.100023 0.120449 0.098506 0.089228 0.120400 0.120798 0.078263 0.105267 0.106323 0.117284 0.119912 0.121974
qa: -0.1720 -0.1145 0.2578 -0.0962 0.0453 -0.0925 -0.2256 -0.1843 -0.2255 -0.1456 -0.0790 -0.0696 -0.0765 -0.1401 -0.1218 -0.0674 0.1118 -0.1568 -0.2031 -0.1377 -0.1081 -0.1236 0.0906 0.1071 0.0860 0.0724 0.1079 0.0875 0.0864 0.0730 0.1153 0.1000 0.1204 0.0985 0.0892 0.1204 0.1208 0.0783 0.1053 0.1063 0.1173 0.1199 0.1220
va: 2.8608 3.8684 3.3517 3.8300 3.8206 3.9857 3.9950 3.9680 3.9426 3.9756 3.9205 3.8572 3.8282 3.9409 3.9344 3.8727 3.6550 3.9256 4.0068 3.9541 3.9439 3.9518 1.0117 0.9938 0.9963 1.0139 1.0430 0.9993 0.9999 0.9983 1.0233 1.0158 1.0003 1.0161 1.0245 1.0022 1.0000 1.0262 1.0181 1.0165 1.0039 1.0011 0.9993
dispcorr: -0.025153144 hartree
energy: -867.681956551366
dipole: -9.10703 8.83553 -0.27151 -5.11826 5.12699 0.00873 2.98292 -2.89457 0.08834
magnitude: 0.28565 au
magnitude: 0.72607 debye
