program: Orca
programVersion: 5.0.2
elementType: N C C C C C C C C C C C C C C C C C C C C C H H H H H H H H H H H H H H H H H H H H H
charge: 0
multiplicity: 1
keywords: wb97x-d3
keywords: def2-TZVPP
keywords: def2/J RIJCOSX
keywords: DEFGRID2
keywords: scfconv7
keywords: smallprint printgap noloewdin
keywords: NOSOSCF
formula: C21H21N
InChI: InChI=1/C21H21N/c1-22(16-8-11-18-9-3-2-4-10-18)17-20-14-7-13-19-12-5-6-15-21(19)20/h2-15H,16-17H2,1H3
43 atoms
N  -2.039094 -1.493336 0.158263
C  -1.803937 -0.109101 0.511854
C  -1.445236 0.765998 -0.665495
C  -1.381162 2.180678 -0.502991
C  -1.022699 2.9925 -1.611626
C  -1.728976 -2.405137 1.234931
C  -1.139369 0.221425 -1.884854
C  -3.373983 -1.692487 -0.360925
C  -1.647647 2.820528 0.73112
C  -0.730787 2.384932 -2.85368
C  -0.784654 1.028878 -2.983202
C  -0.956463 4.394606 -1.451733
C  -0.263544 -2.575747 1.497545
C  -1.57224 4.180401 0.856787
C  -1.224896 4.98018 -0.247061
C  0.713708 -2.175382 0.686033
C  2.153211 -2.331671 0.909414
C  3.037578 -1.593383 0.122196
C  2.690099 -3.18817 1.873259
C  4.408693 -1.690782 0.299648
C  4.058293 -3.287642 2.052297
C  4.9253 -2.537798 1.267677
H  -0.979471 -0.06591 1.229529
H  -2.679448 0.311805 1.033957
H  -2.144238 -3.38629 0.978705
H  -2.230433 -2.123509 2.178687
H  -1.172695 -0.853962 -2.000944
H  -3.560168 -1.008712 -1.188803
H  -4.161022 -1.524423 0.390739
H  -3.483074 -2.70832 -0.742519
H  -1.912134 2.230653 1.598217
H  -0.4597 3.010703 -3.69529
H  -0.555547 0.561575 -3.932066
H  -0.683658 5.002721 -2.305871
H  -0.028292 -3.075345 2.43261
H  -1.780089 4.645461 1.811517
H  -1.168812 6.055097 -0.137554
H  0.438781 -1.660007 -0.228812
H  2.640062 -0.92646 -0.6339
H  2.033285 -3.79639 2.482363
H  5.074218 -1.104853 -0.320863
H  4.45258 -3.958752 2.804378
H  5.995082 -2.619252 1.408065
totalener: -867.66193841 hartree
nucrepener: 1623.25996741 hartree
electener: -2490.92190583 hartree
oneelecener: -4395.95959833 hartree
twoeener: 1905.03769250 hartree
kineticenergy: 863.64008191 hartree
xcener: -88.227048968273 hartree
chargesum: -0.0000000
charge: -0.179080 -0.126623 0.232505 -0.160266 0.011490 -0.030872 -0.227970 -0.189958 -0.185116 -0.123605 -0.110704 -0.071578 -0.143333 -0.133596 -0.114600 -0.048577 0.081388 -0.148683 -0.186767 -0.138840 -0.124794 -0.116898 0.128774 0.087193 0.080317 0.074899 0.135116 0.102860 0.078493 0.090855 0.114626 0.106372 0.123703 0.105964 0.084502 0.121292 0.122866 0.095721 0.111341 0.105912 0.121486 0.120755 0.123431
qa: -0.1791 -0.1266 0.2325 -0.1603 0.0115 -0.0309 -0.2280 -0.1900 -0.1851 -0.1236 -0.1107 -0.0716 -0.1433 -0.1336 -0.1146 -0.0486 0.0814 -0.1487 -0.1868 -0.1388 -0.1248 -0.1169 0.1288 0.0872 0.0803 0.0749 0.1351 0.1029 0.0785 0.0909 0.1146 0.1064 0.1237 0.1060 0.0845 0.1213 0.1229 0.0957 0.1113 0.1059 0.1215 0.1208 0.1234
va: 2.8476 3.8827 3.3635 4.0908 3.9115 3.9813 3.9205 3.9370 4.0048 3.9933 4.0022 3.9311 3.8786 4.0091 3.9660 3.8408 3.7294 3.9955 4.0157 3.9753 3.9705 3.9505 0.9819 0.9995 0.9925 1.0016 1.0328 0.9960 1.0043 0.9996 1.0176 1.0145 1.0019 1.0146 1.0222 1.0039 1.0008 1.0260 1.0141 1.0182 1.0024 1.0025 1.0001
dispcorr: -0.018516226 hartree
energy: -867.680454641341
dipole: -5.98184 5.65577 -0.32607 -6.59828 6.52149 -0.07680 3.02424 -2.78248 0.24176
magnitude: 0.41312 au
magnitude: 1.05007 debye
