program: Orca
programVersion: 5.0.2
elementType: N C C C C C C C C C C C C C C C C C C C C C H H H H H H H H H H H H H H H H H H H H H
charge: 0
multiplicity: 1
keywords: wb97x-d3
keywords: def2-TZVPP
keywords: def2/J RIJCOSX
keywords: DEFGRID2
keywords: scfconv7
keywords: smallprint printgap noloewdin
keywords: NOSOSCF
formula: C21H21N
InChI: InChI=1/C21H21N/c1-22(16-8-11-18-9-3-2-4-10-18)17-20-14-7-13-19-12-5-6-15-21(19)20/h2-15H,16-17H2,1H3
43 atoms
N  -1.910063 -1.350225 0.073182
C  -1.461868 0.010043 0.279214
C  -1.569566 0.866468 -0.960994
C  -1.524749 2.28765 -0.863851
C  -1.62431 3.067428 -2.047544
C  -1.325964 -2.290453 1.008768
C  -1.673169 0.286128 -2.197841
C  -3.352673 -1.441706 0.054618
C  -1.370232 2.969307 0.367336
C  -1.749826 2.422711 -3.298117
C  -1.765711 1.060966 -3.36928
C  -1.588908 4.476905 -1.955622
C  0.15208 -2.418465 0.829117
C  -1.332283 4.335282 0.42433
C  -1.447852 5.101831 -0.749405
C  1.028047 -2.381455 1.8320
C  2.481389 -2.538288 1.738135
C  3.207418 -2.828864 2.893264
C  3.182253 -2.397967 0.538647
C  4.582531 -2.995115 2.85357
C  4.555517 -2.560407 0.497267
C  5.263077 -2.862595 1.653575
H  -0.413115 -0.010162 0.592563
H  -2.013591 0.479828 1.11041
H  -1.786509 -3.265113 0.813582
H  -1.557846 -2.0482 2.060851
H  -1.688648 -0.793529 -2.266361
H  -3.76518 -0.767055 -0.695009
H  -3.813621 -1.187065 1.022078
H  -3.661135 -2.454453 -0.20811
H  -1.270924 2.407556 1.285946
H  -1.826605 3.024634 -4.195418
H  -1.853161 0.565403 -4.327407
H  -1.671715 5.058813 -2.865731
H  0.482274 -2.579783 -0.192879
H  -1.211185 4.830846 1.37863
H  -1.4202 6.181958 -0.693325
H  0.642873 -2.239029 2.838908
H  2.683647 -2.932859 3.836189
H  2.652941 -2.140787 -0.369938
H  5.122671 -3.225342 3.76255
H  5.080141 -2.441535 -0.441735
H  6.337344 -2.985848 1.61827
totalener: -867.66286964 hartree
nucrepener: 1583.60087855 hartree
electener: -2451.26374819 hartree
oneelecener: -4316.55409153 hartree
twoeener: 1865.29034334 hartree
kineticenergy: 863.64769253 hartree
xcener: -88.224897044086 hartree
chargesum: 0.0000000
charge: -0.178494 -0.078279 0.169476 -0.152706 0.019946 -0.045729 -0.211952 -0.182071 -0.190667 -0.125677 -0.091066 -0.076307 -0.135246 -0.135687 -0.113099 -0.043838 0.084519 -0.156475 -0.181104 -0.134109 -0.127039 -0.118926 0.120804 0.077636 0.089056 0.062389 0.126200 0.104746 0.077143 0.088787 0.117968 0.105889 0.121817 0.104900 0.094864 0.120565 0.122801 0.077723 0.104338 0.115700 0.122967 0.123126 0.125110
qa: -0.1785 -0.0783 0.1695 -0.1527 0.0199 -0.0457 -0.2120 -0.1821 -0.1907 -0.1257 -0.0911 -0.0763 -0.1352 -0.1357 -0.1131 -0.0438 0.0845 -0.1565 -0.1811 -0.1341 -0.1270 -0.1189 0.1208 0.0776 0.0891 0.0624 0.1262 0.1047 0.0771 0.0888 0.1180 0.1059 0.1218 0.1049 0.0949 0.1206 0.1228 0.0777 0.1043 0.1157 0.1230 0.1231 0.1251
va: 2.8986 3.8426 3.4593 4.0570 3.8989 3.9560 3.9674 3.9304 4.0109 3.9942 3.9659 3.9333 3.8944 4.0061 3.9639 3.8650 3.7332 4.0051 4.0135 3.9736 3.9736 3.9550 0.9880 1.0025 0.9887 1.0105 1.0461 0.9972 1.0063 1.0011 1.0160 1.0147 1.0022 1.0149 1.0301 1.0040 1.0007 1.0246 1.0164 1.0146 1.0016 1.0021 0.9998
dispcorr: -0.017449828 hartree
energy: -867.680319470999
dipole: -4.67420 4.60160 -0.07260 -6.16506 6.03269 -0.13237 3.85143 -3.58277 0.26865
magnitude: 0.30817 au
magnitude: 0.78330 debye
