program: Orca
programVersion: 4.2.1
elementType: Cl N N N N C C C C C C C C C C C C C C C H H H H H H H H H H H H H H H H H
charge: 0
multiplicity: 1
keywords: wb97x-d3
keywords: def2-TZVPP
keywords: def2/J RIJCOSX GRIDX6 NOFINALGRIDX
keywords: grid4 nofinalgrid
keywords: scfconv7
keywords: smallprint printgap noloewdin
keywords: NOSOSCF
formula: C15H17ClN4
InChI: InChI=1/C15H17ClN4/c1-2-3-8-15(9-17,10-20-12-18-11-19-20)13-4-6-14(16)7-5-13/h4-7,11-12H,2-3,8,10H2,1H3
37 atoms
Cl -2.083656 4.967938 0.25096
N  -0.720374 -2.947905 -0.616127
N  -1.026698 -3.782589 0.382053
N  0.07958 -4.869585 -1.239242
N  0.536016 -1.624594 2.503616
C  0.052812 -0.673574 0.117634
C  1.386616 -0.737817 -0.660835
C  -1.039103 -1.545819 -0.555064
C  2.475765 0.174315 -0.113886
C  -0.484907 0.75024 0.191051
C  3.769933 0.049966 -0.908112
C  0.30469 -1.196859 1.460267
C  -0.798274 1.373159 1.392383
C  -0.682431 1.454385 -0.995114
C  4.871169 0.95025 -0.369944
C  -1.291398 2.669866 1.41885
C  -1.175488 2.747699 -0.985278
C  -0.059724 -3.610734 -1.569348
C  -1.475425 3.348251 0.227769
C  -0.529019 -4.914967 -0.038396
H  1.180619 -0.486411 -1.704565
H  1.748447 -1.768938 -0.657921
H  -1.188061 -1.189139 -1.572609
H  -1.983185 -1.43645 -0.026211
H  2.672873 -0.06523 0.935886
H  2.139571 1.214441 -0.135804
H  3.575267 0.294783 -1.956179
H  4.107034 -0.990303 -0.894672
H  -0.662493 0.863195 2.336826
H  -0.445872 1.008549 -1.952784
H  4.57588 2.000527 -0.400936
H  5.787931 0.849691 -0.951774
H  5.111299 0.706624 0.66652
H  -1.524449 3.137831 2.365225
H  -1.318251 3.278133 -1.916368
H  0.279817 -3.145819 -2.481611
H  -0.614779 -5.818133 0.544995
elementType: Cl N C H
totalener: -1261.10534094 hartree
nucrepener: 1604.12317449 hartree
electener: -2865.22851543 hartree
oneelecener: -4904.80541914 hartree
twoeener: 2039.57690372 hartree
cpcmener: -0.03683663 hartree
kineticenergy: 1256.93974913 hartree
xcener: -100.364652682758 hartree
chargesum: -0.0000000
charge: -0.094699 0.097010 -0.343369 -0.415937 -0.068636 0.743187 -0.265576 -0.131582 -0.118733 -0.238931 -0.078392 -0.371070 -0.135058 -0.207931 -0.287365 -0.156374 -0.165559 0.059070 0.120687 0.071977 0.116874 0.119330 0.151031 0.147241 0.074712 0.074827 0.062678 0.062291 0.137449 0.141761 0.079819 0.092030 0.080077 0.146942 0.147680 0.188050 0.164486
qa: -0.0947 0.0970 -0.3434 -0.4159 -0.0686 0.7432 -0.2656 -0.1316 -0.1187 -0.2389 -0.0784 -0.3711 -0.1351 -0.2079 -0.2874 -0.1564 -0.1656 0.0591 0.1207 0.0720 0.1169 0.1193 0.1510 0.1472 0.0747 0.0748 0.0627 0.0623 0.1374 0.1418 0.0798 0.0920 0.0801 0.1469 0.1477 0.1881 0.1645
va: 1.2104 3.3713 2.8898 3.0273 3.1205 3.3686 3.9018 3.8594 3.8745 3.6635 3.8764 4.1191 3.9422 4.0300 3.9478 4.0342 4.0403 4.0557 3.8116 4.0347 1.0007 1.0033 0.9941 1.0123 1.0139 1.0111 1.0065 1.0079 1.0169 1.0094 1.0004 1.0038 1.0000 1.0069 1.0057 0.9855 0.9935
dispcorr: -0.018500275 hartree
energy: -1261.123841215052
dipole: 24.89077 -24.91241 -0.02163 -8.16151 9.74306 1.58156 -7.58965 5.18379 -2.40586
magnitude: 2.87922 au
magnitude: 7.31841 debye
