program: Orca
programVersion: 4.2.1
elementType: Cl N N N N C C C C C C C C C C C C C C C H H H H H H H H H H H H H H H H H
charge: 0
multiplicity: 1
keywords: wb97x-d3
keywords: def2-TZVPP
keywords: def2/J RIJCOSX GRIDX6 NOFINALGRIDX
keywords: grid4 nofinalgrid
keywords: scfconv7
keywords: smallprint printgap noloewdin
keywords: NOSOSCF
formula: C15H17ClN4
InChI: InChI=1/C15H17ClN4/c1-2-3-8-15(9-17,10-20-12-18-11-19-20)13-4-6-14(16)7-5-13/h4-7,11-12H,2-3,8,10H2,1H3
37 atoms
Cl -2.540549 3.662447 0.365417
N  -0.760248 -2.417569 -0.751117
N  -0.918637 -3.448168 0.085856
N  -2.88649 -2.441433 -0.301711
N  1.705243 -2.246339 2.014885
C  1.234312 -1.005268 -0.23702
C  2.615004 -0.656572 -0.849287
C  0.542213 -2.005375 -1.199827
C  3.614936 0.052767 0.060147
C  0.319255 0.19456 -0.032906
C  3.29066 1.48298 0.481934
C  1.474966 -1.693897 1.031482
C  -0.335505 0.441462 1.167439
C  0.058008 1.0328 -1.11428
C  3.25669 2.4724 -0.672594
C  -1.213506 1.507482 1.299246
C  -0.816925 2.099279 -1.000721
C  -1.938281 -1.823681 -0.960211
C  -1.44647 2.330586 0.212138
C  -2.203831 -3.422684 0.320019
H  2.443371 -0.082562 -1.761439
H  3.066133 -1.597451 -1.172809
H  1.157361 -2.893457 -1.328058
H  0.440302 -1.535258 -2.176752
H  4.56988 0.057862 -0.473104
H  3.786321 -0.557018 0.951253
H  4.058712 1.798998 1.192502
H  2.348174 1.519844 1.032791
H  -0.172025 -0.189403 2.031408
H  0.529712 0.866208 -2.074322
H  4.21059 2.487948 -1.203638
H  3.061832 3.484676 -0.316393
H  2.480574 2.235303 -1.400681
H  -1.709006 1.683554 2.243889
H  -1.002467 2.738561 -1.852706
H  -2.060402 -0.968704 -1.606461
H  -2.673117 -4.150185 0.963272
elementType: Cl N C H
totalener: -1261.10207142 hartree
nucrepener: 1680.90244013 hartree
electener: -2942.00451155 hartree
oneelecener: -5058.64258859 hartree
twoeener: 2116.63807704 hartree
cpcmener: -0.03685465 hartree
kineticenergy: 1256.94541125 hartree
xcener: -100.370388107030 hartree
chargesum: -0.0000000
charge: -0.093941 0.119247 -0.347035 -0.408083 -0.068764 0.761819 -0.212495 -0.139593 -0.154436 -0.277064 -0.089398 -0.390900 -0.099229 -0.293516 -0.287447 -0.147306 -0.139709 0.052535 0.126719 0.070457 0.111017 0.116006 0.138099 0.152586 0.089146 0.079601 0.080538 0.062798 0.132787 0.149879 0.089338 0.094965 0.081522 0.147839 0.148711 0.178668 0.164638
qa: -0.0939 0.1192 -0.3470 -0.4081 -0.0688 0.7618 -0.2125 -0.1396 -0.1544 -0.2771 -0.0894 -0.3909 -0.0992 -0.2935 -0.2874 -0.1473 -0.1397 0.0525 0.1267 0.0705 0.1110 0.1160 0.1381 0.1526 0.0891 0.0796 0.0805 0.0628 0.1328 0.1499 0.0893 0.0950 0.0815 0.1478 0.1487 0.1787 0.1646
va: 1.2112 3.3662 2.8908 3.0235 3.1173 3.3713 3.8965 3.8784 3.9003 3.5575 3.8778 4.1427 3.8453 4.0274 3.9239 4.0360 4.0205 4.0730 3.8156 4.0349 0.9980 1.0109 1.0184 0.9889 1.0059 1.0178 1.0076 1.0069 1.0181 1.0084 1.0033 1.0040 1.0002 1.0047 1.0042 0.9920 0.9937
dispcorr: -0.021792735 hartree
energy: -1261.123864150314
dipole: 26.61022 -25.13138 1.47883 -0.32986 1.60566 1.27580 -7.14178 4.49885 -2.64293
magnitude: 3.28629 au
magnitude: 8.35310 debye
