program: Orca
programVersion: 4.2.1
elementType: Cl N N N N C C C C C C C C C C C C C C C H H H H H H H H H H H H H H H H H
charge: 0
multiplicity: 1
keywords: wb97x-d3
keywords: def2-TZVPP
keywords: def2/J RIJCOSX GRIDX6 NOFINALGRIDX
keywords: grid4 nofinalgrid
keywords: scfconv7
keywords: smallprint printgap noloewdin
keywords: NOSOSCF
formula: C15H17ClN4
InChI: InChI=1/C15H17ClN4/c1-2-3-8-15(9-17,10-20-12-18-11-19-20)13-4-6-14(16)7-5-13/h4-7,11-12H,2-3,8,10H2,1H3
37 atoms
Cl -3.011775 3.487416 0.388158
N  -0.633951 -2.34827 -0.857963
N  -0.788775 -3.434895 -0.094992
N  -2.783707 -2.542023 -0.605472
N  1.527554 -2.161175 2.161771
C  1.17383 -0.829075 -0.060214
C  2.569454 -0.323055 -0.486349
C  0.665945 -1.80741 -1.148936
C  3.203322 0.660382 0.487238
C  0.157805 0.289095 0.116962
C  4.592339 1.112783 0.047478
C  1.345961 -1.573972 1.188219
C  -0.727624 0.322754 1.186881
C  0.04005 1.261943 -0.873734
C  4.597441 1.909923 -1.24929
C  -1.70427 1.303756 1.278948
C  -0.929486 2.247317 -0.797135
C  -1.829229 -1.822111 -1.139109
C  -1.797302 2.259938 0.284101
C  -2.087852 -3.509761 0.023425
H  2.472484 0.12183 -1.478463
H  3.220619 -1.192584 -0.610421
H  1.365602 -2.630856 -1.276416
H  0.612315 -1.270835 -2.095156
H  3.278893 0.198979 1.475642
H  2.560912 1.537457 0.605694
H  5.244976 0.240617 -0.052933
H  5.023446 1.723018 0.844269
H  -0.677755 -0.418676 1.973825
H  0.701423 1.266434 -1.730708
H  3.929821 2.771719 -1.184823
H  4.279505 1.311277 -2.10403
H  5.596022 2.284977 -1.475814
H  -2.382562 1.311679 2.12072
H  -1.00305 2.994302 -1.575572
H  -1.955975 -0.939009 -1.746207
H  -2.557613 -4.304831 0.580848
elementType: Cl N C H
totalener: -1261.10541019 hartree
nucrepener: 1650.76662074 hartree
electener: -2911.87203093 hartree
oneelecener: -4998.28944574 hartree
twoeener: 2086.41741481 hartree
cpcmener: -0.03653369 hartree
kineticenergy: 1256.94684540 hartree
xcener: -100.368457565913 hartree
chargesum: -0.0000000
charge: -0.093102 0.120096 -0.345978 -0.405869 -0.070801 0.683674 -0.266300 -0.131364 -0.108144 -0.227594 -0.101158 -0.360717 -0.123582 -0.212167 -0.279269 -0.151464 -0.149953 0.047872 0.121336 0.070519 0.107678 0.118775 0.141688 0.147842 0.083984 0.080172 0.058800 0.074364 0.137164 0.142189 0.081924 0.079078 0.095626 0.146621 0.147379 0.176397 0.164284
qa: -0.0931 0.1201 -0.3460 -0.4059 -0.0708 0.6837 -0.2663 -0.1314 -0.1081 -0.2276 -0.1012 -0.3607 -0.1236 -0.2122 -0.2793 -0.1515 -0.1500 0.0479 0.1213 0.0705 0.1077 0.1188 0.1417 0.1478 0.0840 0.0802 0.0588 0.0744 0.1372 0.1422 0.0819 0.0791 0.0956 0.1466 0.1474 0.1764 0.1643
va: 1.2120 3.3679 2.8951 3.0216 3.1185 3.5525 3.9106 3.8822 3.8456 3.6201 3.8941 4.1283 3.8859 4.0130 3.9236 4.0454 4.0260 4.0789 3.8176 4.0356 0.9992 1.0098 1.0143 0.9922 1.0202 1.0093 1.0091 1.0062 1.0150 1.0080 1.0016 0.9997 1.0038 1.0056 1.0051 0.9926 0.9941
dispcorr: -0.020245722 hartree
energy: -1261.125655909429
dipole: 32.05230 -30.44568 1.60662 -0.03489 1.58216 1.54727 -7.80532 5.37856 -2.42676
magnitude: 3.29613 au
magnitude: 8.37808 debye
