program: Gaussian 09
title: 000063526
version: EM64L-G09RevD.01
frameworkgroup: C1[X(C20H24N4O)]
method: RPBEPBE
basis: SDD
operation: Freq
keyword: #p
keyword: freq=noraman
keyword: PBEPBE/SDD
title: #p freq=noraman PBEPBE/SDD
converged: YES YES NO NO
title: Mulliken charges:
elementType: O N N N N C C C C C C C C C C C C C C C C C C C C H H H H H H H H H H H H H H H H H H H H H H H H
charge: -0.247202 -0.086977 -0.362717 0.039463 -0.700990 -0.449242 0.051424 -0.292489 -0.300675 0.317778 0.079832 0.216272 0.015584 0.360984 -0.702976 -0.687054 -0.553211 -0.310546 -0.343258 0.531747 -0.408174 -0.409732 -0.835563 -0.254331 -0.232396 0.228279 0.221551 0.177626 0.215273 0.174283 0.206779 0.237546 0.206141 0.208855 0.237482 0.209939 0.207586 0.265915 0.243255 0.258591 0.233714 0.221446 0.225180 0.237054 0.267213 0.231639 0.227230 0.313953 0.307917
chargesum: 0.00000
title: Mulliken charges with hydrogens summed into heavy atoms:
elementType: O N N N N C C C C C C C C C C C C C C C C C C C C
charge: -0.247202 -0.086977 -0.362717 0.039463 -0.079121 0.000588 0.051424 0.100410 0.080387 0.317778 0.079832 0.216272 0.015584 0.360984 -0.050434 -0.032047 -0.287296 -0.067290 -0.084667 0.531747 -0.174460 -0.188286 -0.106115 -0.022692 -0.005165
polarizability: 3.48782831e+02 2.77530279e+01 2.53806608e+02 3.04240641e-01 -1.06073803e+01 1.87996007e+02
1716.lowfreq: -18.1278 -10.9356 -6.9033 -0.0001 0.0004 0.0007 6.5345 17.5923 23.3857
frequency: -15.4166 17.4868 23.3308 31.8225 34.4898 45.7522 62.8657 80.8090 99.7060 132.2234 138.6313 157.9767 167.5663 172.0379 192.5806 203.9484 224.8631 228.9026 235.8533 285.2990 307.9364 310.4909 331.9084 339.3737 368.6876 372.8616 380.1609 404.0731 421.9087 423.9521 450.7806 463.2262 465.7373 482.6975 516.5522 535.1648 542.2579 563.7224 585.1572 612.2268 634.2498 676.2712 702.4448 709.7798 718.4664 744.2031 755.0001 779.3352 790.0496 795.4213 799.8549 803.3665 836.2332 851.8873 870.9237 904.1805 912.0507 925.4252 947.8311 966.6759 966.9090 987.7982 988.4848 991.0527 1003.2723 1030.9357 1044.1057 1045.7873 1059.7555 1072.0843 1074.3742 1087.9634 1113.1221 1116.7028 1129.9719 1160.9104 1173.2443 1180.7150 1195.7119 1197.4909 1215.6855 1231.2135 1259.1692 1274.9997 1280.8023 1281.4994 1285.3474 1301.7357 1335.2395 1359.3450 1365.5722 1372.8456 1378.4008 1385.0111 1386.2751 1399.0677 1401.0125 1433.6412 1455.4605 1457.6091 1465.5276 1467.8174 1468.5725 1468.7612 1475.0270 1476.5998 1484.3235 1486.0097 1492.9413 1493.3341 1544.4429 1558.8731 1590.2463 1604.0981 1614.6329 1635.3287 1646.7518 2829.6104 2841.1602 2898.3284 2979.6359 2984.7088 2985.9720 3015.4237 3044.6235 3046.3295 3057.4187 3074.5638 3078.2841 3090.0873 3093.5600 3096.3562 3122.8273 3124.3186 3137.6092 3140.4905 3150.8603 3165.9025 3167.4207 3565.9215 3706.5599
redmass: 2.7437 3.7455 3.6346 3.5892 2.7930 3.6775 4.4631 2.4058 3.0250 3.2186 1.2250 5.0444 2.1058 2.4489 2.2638 3.3390 2.0018 4.4134 2.1402 2.0973 2.6138 3.1867 3.0130 3.6276 1.3220 2.6757 3.4185 1.3282 3.1482 3.0891 3.2695 3.6249 4.0029 3.2527 4.1054 5.1077 7.9756 5.8786 3.8847 5.2515 5.4699 6.0472 5.0849 5.1096 3.6895 2.4462 1.9714 2.6816 3.5979 1.1676 2.6960 1.4942 1.6568 4.7315 1.3375 1.6306 2.2345 2.6785 1.4578 1.4857 2.5945 1.5422 1.3891 1.9004 3.3290 1.7761 2.0015 1.5704 2.6480 2.6262 1.9896 2.0433 1.8160 1.8344 1.4278 2.0932 1.0629 2.5444 2.4266 3.0157 2.5269 1.7140 2.9042 1.1765 1.2247 1.5752 1.9299 1.7592 3.5344 1.3230 1.3642 7.6283 1.4579 1.2200 1.2402 1.2638 6.0639 2.0638 1.0945 4.4412 1.0557 1.0566 1.0622 1.0655 1.0758 1.3625 1.9368 1.0581 1.0745 4.0175 10.1478 7.1166 6.6008 11.7076 6.7134 2.1585 1.8361 1.0724 1.0712 1.0696 1.0374 1.0358 1.0358 1.0870 1.0862 1.0872 1.0973 1.0986 1.0967 1.0990 1.1004 1.1003 1.0894 1.0864 1.0891 1.0917 1.0943 1.0954 1.1006 1.0449 1.1041
irintensity: 0.1213 0.1279 0.1844 1.1564 0.6311 2.3191 1.1349 2.1627 1.3172 1.8352 1.2205 0.7201 0.5122 0.4825 1.5455 0.1116 1.8752 3.6449 1.8750 0.3357 2.5261 4.3741 2.0200 0.2693 151.9944 9.7180 7.0862 145.0932 4.8302 1.3497 3.9195 1.0416 3.9016 5.4725 5.0807 4.6958 0.6048 1.3335 6.6587 4.2086 11.7270 4.2701 5.1839 2.3520 1.8769 35.7044 47.4737 5.1853 2.1844 6.2488 10.0417 1.9510 52.6869 10.4038 0.3922 20.7635 12.4336 3.2604 0.4435 3.5784 20.8428 1.0028 0.4759 3.7706 1.1829 1.9961 7.5088 12.3313 2.4411 17.0115 24.7996 7.0290 46.0592 16.5961 14.1307 35.7861 1.2379 2.5229 43.8444 7.3000 22.4936 8.1843 29.8850 13.3931 14.7064 0.1426 6.6215 24.5662 102.5347 7.8571 12.1102 3.1498 21.3613 20.5427 22.2884 15.6612 46.4938 3.9434 1.3785 9.3688 11.1281 8.4258 20.3473 0.5695 1.9970 20.5564 87.9068 12.1118 8.1671 143.8867 62.3865 49.2807 0.2795 291.7390 11.1970 8.7303 396.2412 51.0836 146.8960 99.8210 18.6228 36.1148 30.0287 27.5574 6.8345 10.5384 11.4422 24.6701 105.2974 26.3542 33.3466 30.3935 22.8164 5.1256 7.4995 12.1852 34.2679 11.4010 19.7359 120.2685 22.4023
temp: 298.150 k
press: 1.00000 atm
elementType: 8 7 7 7 7 6 6 6 6 6 6 6 6 6 6 6 6 6 6 6 6 6 6 6 6 1 1 1 1 1 1 1 1 1 1 1 1 1 1 1 1 1 1 1 1 1 1 1 1
symmnumber: 1
zpe: 1055048.0 jmol-1
zpe.correction: 0.401847 hartree
zpe.thermalcorrener: 0.425694 hartree
zpe.thermalcorrenthalpy: 0.426639 hartree
zpe.thermalcorrgfe: 0.346749 hartree
zpe.sumelectzpe: -1068.950145 hartree
zpe.sumelectthermal: -1068.926297 hartree
zpe.sumelectthermalent: -1068.925353 hartree
zpe.sumelectthermalfe: -1069.005243 hartree
dipole: 0.8174 0.3943 -0.2670
dipole: 0.9460
quadrupole: -104.7642 -153.3153 -144.1830
quadrupole: 6.5891 1.5122 4.0270
quadrupole: 29.3233 -19.2278 -10.0955 6.5891 1.5122 4.0270
hfenergy: -1069.3519917 hartree
pointgroup: C01 [X(C20H24N4O1)]
dipole: -0.3366468 -0.0962393 -0.1262462 debye
polarizability: 354.5832782|10.0745857|246.5484597|10.4873195|13.1210001|189.4537074 unknown
InChI: InChI=1S/C20H24N4O/c1-4-23(5-2)13-19-22-17-11-10-15(21)12-16(17)20(25)24(19)18-9-7-6-8-14(18)3/h6-12H,4-5,13,21H2,1-3H3
charge 0 multiplicity 1
49 atoms
O  -0.977069 2.579365 0.601435
N  1.702414 -2.648912 0.036294
N  0.187821 0.623882 -0.000326
N  -0.946438 -1.376308 -0.724505
N  -5.957544 1.097608 0.177233
C  1.500608 -1.415008 -0.764731
C  0.173224 -0.719532 -0.476127
C  1.821452 -2.368931 1.491132
C  2.810508 -3.477916 -0.505721
C  1.433216 1.351485 0.239505
C  -1.022019 1.369578 0.225536
C  -2.261062 0.608604 -0.017662
C  -2.172825 -0.740512 -0.487985
C  2.004102 2.125034 -0.806861
C  1.619655 -3.617707 2.369633
C  2.460724 -4.162161 -1.84204
C  -3.513037 1.225621 0.202771
C  2.014587 1.305753 1.523067
C  -3.383959 -1.449622 -0.728448
C  -4.711469 0.510619 -0.035941
C  3.206078 2.821091 -0.527191
C  -4.624202 -0.84294 -0.50785
C  1.336039 2.220851 -2.163543
C  3.209089 2.011148 1.782475
C  3.809595 2.765893 0.749676
H  2.342777 -0.693771 -0.641499
H  1.471483 -1.710506 -1.828186
H  2.797831 -1.877534 1.743069
H  1.026199 -1.642882 1.744896
H  3.75423 -2.881653 -0.62048
H  3.025819 -4.265254 0.237356
H  0.667612 -4.110355 2.106313
H  2.434583 -4.355212 2.256849
H  1.585073 -3.327665 3.436304
H  1.520879 -4.730731 -1.736782
H  2.332138 -3.440145 -2.668412
H  3.268568 -4.85799 -2.135809
H  -3.523306 2.261908 0.559158
H  1.521666 0.73097 2.313707
H  -3.311244 -2.480886 -1.087029
H  3.666681 3.421443 -1.320654
H  -5.547557 -1.404777 -0.696244
H  1.951594 2.804731 -2.868177
H  1.156351 1.224615 -2.60893
H  0.352006 2.717933 -2.075724
H  3.660155 1.976714 2.77977
H  4.736999 3.317711 0.93919
H  -6.029933 2.053753 0.512292
H  -6.81489 0.581801 0.003598
