program: Orca
programVersion: 4.2.1
elementType: Cl N N N N C C C C C C C C C C C C C C C H H H H H H H H H H H H H H H H H
charge: 0
multiplicity: 1
keywords: wb97x-d3
keywords: def2-TZVPP
keywords: def2/J RIJCOSX GRIDX6 NOFINALGRIDX
keywords: grid4 nofinalgrid
keywords: scfconv7
keywords: smallprint printgap noloewdin
keywords: NOSOSCF
formula: C15H17ClN4
InChI: InChI=1/C15H17ClN4/c1-2-3-8-15(9-17,10-20-12-18-11-19-20)13-4-6-14(16)7-5-13/h4-7,11-12H,2-3,8,10H2,1H3
37 atoms
Cl -3.069285 3.400957 0.119377
N  -0.705013 -2.459888 -0.558606
N  -1.814429 -1.946958 -1.099013
N  -2.327147 -3.256487 0.649379
N  1.774386 -1.869256 2.202632
C  1.170041 -0.877826 -0.141116
C  2.497646 -0.409816 -0.776585
C  0.603458 -2.043195 -0.991259
C  3.180908 0.725351 -0.029471
C  0.133767 0.229441 -0.02901
C  4.47823 1.155475 -0.702107
C  1.490397 -1.414579 1.183406
C  -0.129855 1.026692 -1.139405
C  -0.616474 0.425546 1.122588
C  5.173839 2.27771 0.052131
C  -1.109638 2.002946 -1.101552
C  -1.603769 1.39901 1.177263
C  -1.027899 -3.226849 0.486083
C  -1.841959 2.18108 0.062243
C  -2.752509 -2.454424 -0.345281
H  2.292385 -0.111651 -1.80698
H  3.166709 -1.271968 -0.839355
H  1.280577 -2.895761 -0.960345
H  0.525429 -1.720448 -2.027312
H  3.395142 0.419766 0.999622
H  2.509541 1.585882 0.038312
H  4.26646 1.476972 -1.725886
H  5.149604 0.295938 -0.783926
H  0.423181 0.896242 -2.060575
H  -0.449316 -0.17533 2.007192
H  4.535376 3.159832 0.127899
H  6.095833 2.581414 -0.444679
H  5.43271 1.971864 1.067425
H  -1.29763 2.614334 -1.973226
H  -2.174517 1.537106 2.08497
H  -0.298981 -3.76009 1.07553
H  -3.794845 -2.245231 -0.527097
elementType: Cl N C H
totalener: -1261.10552587 hartree
nucrepener: 1647.53184666 hartree
electener: -2908.63737253 hartree
oneelecener: -4992.19684186 hartree
twoeener: 2083.55946933 hartree
cpcmener: -0.03248729 hartree
kineticenergy: 1256.95508193 hartree
xcener: -100.367698041809 hartree
chargesum: 0.0000000
charge: -0.096678 0.106786 -0.330472 -0.405630 -0.072425 0.683529 -0.239693 -0.117102 -0.106571 -0.184140 -0.078158 -0.375481 -0.212454 -0.145176 -0.286854 -0.155802 -0.169672 0.058502 0.124554 0.059273 0.102677 0.115953 0.156156 0.132713 0.075067 0.073665 0.063556 0.061309 0.141537 0.138042 0.080092 0.092216 0.080165 0.147657 0.146718 0.173729 0.162411
qa: -0.0967 0.1068 -0.3305 -0.4056 -0.0724 0.6835 -0.2397 -0.1171 -0.1066 -0.1841 -0.0782 -0.3755 -0.2125 -0.1452 -0.2869 -0.1558 -0.1697 0.0585 0.1246 0.0593 0.1027 0.1160 0.1562 0.1327 0.0751 0.0737 0.0636 0.0613 0.1415 0.1380 0.0801 0.0922 0.0802 0.1477 0.1467 0.1737 0.1624
va: 1.2082 3.3878 2.8882 3.0343 3.1100 3.5301 3.9033 3.8661 3.8330 3.6251 3.8761 4.1074 4.0051 3.9013 3.9472 4.0365 4.0614 4.0688 3.8067 4.0438 1.0057 1.0094 0.9996 1.0076 1.0136 1.0121 1.0068 1.0085 1.0077 1.0138 1.0002 1.0039 1.0000 1.0047 1.0057 0.9991 0.9960
dispcorr: -0.019815513 hartree
energy: -1261.125341385144
dipole: 33.47740 -31.56753 1.90987 -0.70086 1.00456 0.30370 -5.60191 3.54987 -2.05203
magnitude: 2.81970 au
magnitude: 7.16710 debye
