program: Orca
programVersion: 4.2.1
elementType: Cl N N N N C C C C C C C C C C C C C C C H H H H H H H H H H H H H H H H H
charge: 0
multiplicity: 1
keywords: wb97x-d3
keywords: def2-TZVPP
keywords: def2/J RIJCOSX GRIDX6 NOFINALGRIDX
keywords: grid4 nofinalgrid
keywords: scfconv7
keywords: smallprint printgap noloewdin
keywords: NOSOSCF
formula: C15H17ClN4
InChI: InChI=1/C15H17ClN4/c1-2-3-8-15(9-17,10-20-12-18-11-19-20)13-4-6-14(16)7-5-13/h4-7,11-12H,2-3,8,10H2,1H3
37 atoms
Cl -2.091477 4.967078 0.264409
N  -0.706714 -2.950722 -0.62051
N  -1.014838 -3.765706 0.391559
N  0.042065 -4.893657 -1.22725
N  0.538264 -1.626784 2.493584
C  0.05717 -0.672504 0.108563
C  1.39252 -0.728779 -0.668138
C  -1.028442 -1.548836 -0.569716
C  2.481318 0.179961 -0.11492
C  -0.485485 0.749978 0.187463
C  3.777721 0.058421 -0.906693
C  0.305216 -1.204626 1.450243
C  -0.799475 1.368659 1.390961
C  -0.686428 1.459358 -0.995103
C  4.878273 0.957091 -0.365385
C  -1.294476 2.664573 1.422755
C  -1.181791 2.751838 -0.980107
C  -0.075333 -3.638062 -1.579036
C  -1.481141 3.348214 0.234965
C  -0.54845 -4.916953 -0.01501
H  1.18832 -0.470692 -1.710913
H  1.754501 -1.759818 -0.671852
H  -1.174954 -1.194519 -1.589076
H  -1.975184 -1.442354 -0.043278
H  2.675934 -0.065417 0.934171
H  2.145999 1.220773 -0.131339
H  3.586937 0.305204 -1.955596
H  4.116203 -0.981942 -0.895138
H  -0.662189 0.856273 2.33414
H  -0.451176 1.019083 -1.955838
H  4.58549 2.008535 -0.395131
H  5.796117 0.856361 -0.946434
H  5.118368 0.71233 0.671169
H  -1.52652 3.128018 2.371832
H  -1.326219 3.285307 -1.909504
H  0.263422 -3.189703 -2.500148
H  -0.641789 -5.81099 0.581616
elementType: Cl N C H
totalener: -1261.11338486 hartree
nucrepener: 1603.10678122 hartree
electener: -2864.22016609 hartree
oneelecener: -4902.86246427 hartree
twoeener: 2038.64229818 hartree
cpcmener: -0.03187987 hartree
kineticenergy: 1256.91976163 hartree
xcener: -100.360541013627 hartree
chargesum: -0.0000000
charge: -0.091715 0.096723 -0.337519 -0.409169 -0.053278 0.734565 -0.263057 -0.135377 -0.116863 -0.232606 -0.079397 -0.380053 -0.131752 -0.211864 -0.284684 -0.153051 -0.164792 0.057308 0.118858 0.073087 0.111935 0.119049 0.147507 0.147421 0.076314 0.073691 0.061235 0.062568 0.137717 0.138584 0.079169 0.091541 0.080398 0.145209 0.145344 0.184134 0.162818
qa: -0.0917 0.0967 -0.3375 -0.4092 -0.0533 0.7346 -0.2631 -0.1354 -0.1169 -0.2326 -0.0794 -0.3801 -0.1318 -0.2119 -0.2847 -0.1531 -0.1648 0.0573 0.1189 0.0731 0.1119 0.1190 0.1475 0.1474 0.0763 0.0737 0.0612 0.0626 0.1377 0.1386 0.0792 0.0915 0.0804 0.1452 0.1453 0.1841 0.1628
va: 1.2134 3.3644 2.8863 3.0315 3.1207 3.3833 3.9005 3.8619 3.8725 3.6622 3.8775 4.1178 3.9441 4.0331 3.9490 4.0335 4.0470 4.0549 3.8248 4.0322 1.0019 1.0034 0.9947 1.0128 1.0140 1.0113 1.0061 1.0078 1.0172 1.0102 1.0006 1.0039 1.0003 1.0073 1.0066 0.9868 0.9936
dispcorr: -0.018471393 hartree
energy: -1261.131856254135
dipole: 24.95875 -24.95935 -0.00059 -8.12363 9.64950 1.52588 -7.63835 5.35197 -2.28638
magnitude: 2.74879 au
magnitude: 6.98686 debye
