program: Orca
programVersion: 4.2.1
elementType: Cl N N N N C C C C C C C C C C C C C C C H H H H H H H H H H H H H H H H H
charge: 0
multiplicity: 1
keywords: wb97x-d3
keywords: def2-TZVPP
keywords: def2/J RIJCOSX GRIDX6 NOFINALGRIDX
keywords: grid4 nofinalgrid
keywords: scfconv7
keywords: smallprint printgap noloewdin
keywords: NOSOSCF
formula: C15H17ClN4
InChI: InChI=1/C15H17ClN4/c1-2-3-8-15(9-17,10-20-12-18-11-19-20)13-4-6-14(16)7-5-13/h4-7,11-12H,2-3,8,10H2,1H3
37 atoms
Cl -3.606363 3.263506 0.34364
N  -0.354404 -2.127842 -0.758485
N  -0.441812 -3.172577 0.068085
N  -2.457743 -2.653429 -0.755243
N  1.578885 -1.65822 2.407633
C  1.187621 -0.400673 0.1486
C  2.501777 0.354698 -0.168452
C  0.894588 -1.443451 -0.958226
C  3.753812 -0.512653 -0.255611
C  0.004103 0.554524 0.256444
C  5.032103 0.316566 -0.350895
C  1.38373 -1.109482 1.416513
C  -0.239274 1.456164 -0.77799
C  -0.896195 0.506622 1.313945
C  5.121774 1.18314 -1.598505
C  -1.342559 2.292181 -0.757135
C  -2.006046 1.338372 1.350299
C  -1.565496 -1.823715 -1.235892
C  -2.222045 2.225928 0.311858
C  -1.718411 -3.454051 0.038499
H  2.635318 1.121106 0.599248
H  2.358861 0.88392 -1.11157
H  1.683807 -2.190422 -1.011975
H  0.858689 -0.930558 -1.918838
H  3.698715 -1.176957 -1.122974
H  3.825927 -1.15801 0.624155
H  5.884906 -0.366437 -0.327968
H  5.122943 0.944022 0.541007
H  0.425076 1.521487 -1.629812
H  -0.755522 -0.183767 2.135429
H  5.01129 0.585321 -2.506051
H  6.087822 1.686903 -1.655266
H  4.355991 1.960221 -1.619891
H  -1.51046 2.984337 -1.570906
H  -2.69207 1.282998 2.184303
H  -1.741181 -1.011242 -1.923767
H  -2.133015 -4.274068 0.604034
elementType: Cl N C H
totalener: -1261.11170285 hartree
nucrepener: 1637.93321617 hartree
electener: -2899.04491902 hartree
oneelecener: -4972.69858918 hartree
twoeener: 2073.65367015 hartree
cpcmener: -0.03184838 hartree
kineticenergy: 1256.92588620 hartree
xcener: -100.363945095822 hartree
chargesum: 0.0000000
charge: -0.090947 0.122982 -0.345536 -0.400122 -0.060078 0.741819 -0.241137 -0.146657 -0.117775 -0.208800 -0.116950 -0.388077 -0.242395 -0.143453 -0.282338 -0.152804 -0.142213 0.052999 0.116500 0.067683 0.115019 0.107527 0.143754 0.148498 0.073539 0.088629 0.075135 0.062000 0.141154 0.139242 0.083091 0.094868 0.079168 0.145164 0.144621 0.173119 0.162769
qa: -0.0909 0.1230 -0.3455 -0.4001 -0.0601 0.7418 -0.2411 -0.1467 -0.1178 -0.2088 -0.1170 -0.3881 -0.2424 -0.1435 -0.2823 -0.1528 -0.1422 0.0530 0.1165 0.0677 0.1150 0.1075 0.1438 0.1485 0.0735 0.0886 0.0751 0.0620 0.1412 0.1392 0.0831 0.0949 0.0792 0.1452 0.1446 0.1731 0.1628
va: 1.2139 3.3658 2.8792 3.0296 3.1180 3.4793 3.9028 3.8784 3.8579 3.5796 3.9004 4.1340 4.0510 3.9111 3.9281 4.0322 4.0400 4.0686 3.8297 4.0370 1.0041 0.9964 1.0122 0.9909 1.0105 1.0200 1.0069 1.0090 1.0103 1.0162 0.9999 1.0045 0.9987 1.0061 1.0064 0.9936 0.9943
dispcorr: -0.019658323 hartree
energy: -1261.131361175722
dipole: 35.85811 -34.30947 1.54864 -2.88773 4.44824 1.56051 -9.59969 7.32059 -2.27910
magnitude: 3.16667 au
magnitude: 8.04903 debye
