program: Orca
programVersion: 4.2.1
elementType: Cl N N N N C C C C C C C C C C C C C C C H H H H H H H H H H H H H H H H H
charge: 0
multiplicity: 1
keywords: wb97x-d3
keywords: def2-TZVPP
keywords: def2/J RIJCOSX GRIDX6 NOFINALGRIDX
keywords: grid4 nofinalgrid
keywords: scfconv7
keywords: smallprint printgap noloewdin
keywords: NOSOSCF
formula: C15H17ClN4
InChI: InChI=1/C15H17ClN4/c1-2-3-8-15(9-17,10-20-12-18-11-19-20)13-4-6-14(16)7-5-13/h4-7,11-12H,2-3,8,10H2,1H3
37 atoms
Cl -2.647185 3.625592 0.30839
N  -0.816308 -2.44705 -0.675017
N  -0.887957 -3.385641 0.271998
N  -2.916392 -2.534457 -0.14279
N  1.867936 -2.077659 1.902819
C  1.183336 -0.987778 -0.371794
C  2.504455 -0.637454 -1.1004
C  0.447283 -2.048144 -1.231507
C  3.529838 0.185309 -0.326808
C  0.252433 0.197925 -0.156266
C  3.140158 1.617367 0.021537
C  1.54154 -1.602539 0.908345
C  -0.368112 0.443784 1.062069
C  -0.055717 1.023849 -1.234629
C  4.302865 2.385102 0.632594
C  -1.259041 1.496362 1.214113
C  -0.943017 2.077654 -1.100153
C  -2.032544 -1.942628 -0.907007
C  -1.538605 2.30854 0.130077
C  -2.16335 -3.404777 0.559218
H  2.253217 -0.134951 -2.036734
H  2.973024 -1.58261 -1.386149
H  1.066012 -2.936082 -1.351022
H  0.27265 -1.630634 -2.22224
H  4.430337 0.212153 -0.947725
H  3.822092 -0.34674 0.583966
H  2.301409 1.628613 0.720699
H  2.791988 2.133171 -0.878358
H  -0.167679 -0.177656 1.925269
H  0.393874 0.861957 -2.205818
H  4.017595 3.409214 0.877833
H  5.153432 2.436148 -0.050418
H  4.649942 1.913332 1.554197
H  -1.726905 1.670684 2.173298
H  -1.16344 2.709541 -1.949657
H  -2.219966 -1.168118 -1.634368
H  -2.569169 -4.077401 1.298848
elementType: Cl N C H
totalener: -1261.11113312 hartree
nucrepener: 1666.43238171 hartree
electener: -2927.54351484 hartree
oneelecener: -5029.86128935 hartree
twoeener: 2102.31777451 hartree
cpcmener: -0.03224812 hartree
kineticenergy: 1256.93174929 hartree
xcener: -100.365490705553 hartree
chargesum: -0.0000000
charge: -0.091629 0.121434 -0.345514 -0.400389 -0.055716 0.723238 -0.199275 -0.136263 -0.150164 -0.283768 -0.063981 -0.389307 -0.097617 -0.236554 -0.292199 -0.150974 -0.146054 0.054173 0.126433 0.070055 0.106714 0.114278 0.138270 0.147028 0.083356 0.072688 0.063570 0.063177 0.133749 0.138392 0.092060 0.081048 0.082309 0.145988 0.146142 0.173017 0.162285
qa: -0.0916 0.1214 -0.3455 -0.4004 -0.0557 0.7232 -0.1993 -0.1363 -0.1502 -0.2838 -0.0640 -0.3893 -0.0976 -0.2366 -0.2922 -0.1510 -0.1461 0.0542 0.1264 0.0701 0.1067 0.1143 0.1383 0.1470 0.0834 0.0727 0.0636 0.0632 0.1337 0.1384 0.0921 0.0810 0.0823 0.1460 0.1461 0.1730 0.1623
va: 1.2132 3.3592 2.8813 3.0298 3.1198 3.4279 3.9138 3.8831 3.8813 3.6168 3.8464 4.1309 3.8507 3.9990 3.9591 4.0461 4.0233 4.0702 3.8229 4.0352 1.0041 1.0088 1.0170 0.9907 1.0068 1.0146 1.0035 1.0085 1.0178 1.0133 1.0025 1.0015 0.9994 1.0054 1.0048 0.9939 0.9943
dispcorr: -0.020906775 hartree
energy: -1261.132039899727
dipole: 28.36024 -27.20178 1.15846 -0.33581 1.41523 1.07942 -5.67107 2.93884 -2.73223
magnitude: 3.15789 au
magnitude: 8.02671 debye
